{"text_format":"1","workbook":"xlsx","n_sheets":18,"sheets":["Cal","Holidays","Diary","Events","Jan","Feb","Mar","Apr","May","Jun","Jul","Aug","Sep","Oct","Nov","Dec","Mini","Años"],"not_rendered":{"charts":0,"images":44,"macros":0,"external_links":0,"defined_names":16,"comments":4,"pivot_tables":0},"unopened":[],"bounds":{"document_bytes":16777216,"sheet_cells":100000,"rows_first":2000,"rows_last":500,"rows_between":2000,"halvings":0,"cell_chars":16384,"cell_head_chars":4096},"cells_cut":0,"cells_raw":0,"read":"whole","date_system":"1900"}

{"sheet":"Cal","index":0,"n_rows":46,"n_cols":32,"rows_kept":46,"cut":false,"hidden":false,"merged":[[2,31,2,33],[3,2,3,7],[3,12,3,17],[3,22,3,27],[12,2,12,7],[12,12,12,17],[12,22,12,27],[21,22,21,27],[30,2,30,7],[1,21,1,30],[30,12,30,17],[30,22,30,27],[40,2,40,6],[40,10,40,20],[2,12,2,17],[1,12,1,17],[1,1,1,8],[21,2,21,7],[21,12,21,17]]}
[]
[null,"Country Holidays",null,null,null,null,null,null,null,null,null,null,"Diary",null,null,null,null,null,null,null,null,"Programmable Events"]
[null,null,null,null,null,null,null,null,null,null,null,null,2010,null,null,null,null,null,null,null,null,null,null,null,null,null,null,null,null,null,null,"Notes"]
[null,1,{"$f":"DATE($M$3,1,1)","v":"2010-01-01"},null,null,null,null,null,{"$f":"MONTH($C4)","v":1},null,null,{"$f":"MONTH($M4)","v":2},{"$f":"DATE($M$3,2,1)","v":"2010-02-01"},null,null,null,null,null,{"$f":"MONTH($M4)","v":2},null,null,{"$f":"MONTH($W4)","v":3},{"$f":"DATE($M$3,3,1)","v":"2010-03-01"},null,null,null,null,null,{"$f":"MONTH($W4)","v":3}]
[null,{"$f":"C5-1","v":"2010-01-31"},{"$f":"DATE(2010,2,1)","v":"2010-02-01"},{"$f":"C5+1","v":"2010-02-02"},"2010-02-03","2010-02-04","2010-02-05","2010-02-06","2010-02-07",null,null,{"$f":"M5-1","v":"2010-01-31"},{"$f":"DATE(2010,2,1)","v":"2010-02-01"},{"$f":"M5+1","v":"2010-02-02"},"2010-02-03","2010-02-04","2010-02-05","2010-02-06","2010-02-07",null,null,{"$f":"W5-1","v":"2010-01-31"},{"$f":"DATE(2010,2,1)","v":"2010-02-01"},{"$f":"W5+1","v":"2010-02-02"},"2010-02-03","2010-02-04","2010-02-05","2010-02-06","2010-02-07"]
[{"$f":"IF(H6=\"\",\"\",WEEKNUM(H6,1))","v":1},null,{"$f":"IF(WEEKDAY(C4)=2,C4,\"\")","v":""},{"$f":"IF(C6<>\"\",C6+1,IF(WEEKDAY(C4)=3,C4,\"\"))","v":""},{"$f":"IF(D6<>\"\",D6+1,IF(WEEKDAY(C4)=4,C4,\"\"))","v":""},{"$f":"IF(E6<>\"\",E6+1,IF(WEEKDAY(C4)=5,C4,\"\"))","v":""},{"$f":"IF(F6<>\"\",F6+1,IF(WEEKDAY(C4)=6,C4,\"\"))","v":"2010-01-01"},{"$f":"IF(G6<>\"\",G6+1,IF(WEEKDAY(C4)=7,C4,\"\"))","v":"2010-01-02"},{"$f":"IF(H6<>\"\",H6+1,IF(WEEKDAY(C4)=1,C4,\"\"))","v":"2010-01-03"},{"$f":"IF(I6=\"\",\"\",WEEKNUM(I6,2))","v":1},{"$f":"IF(R6=\"\",\"\",WEEKNUM(R6,1))","v":6},null,{"$f":"IF(WEEKDAY(M4)=2,M4,\"\")","v":"2010-02-01"},{"$f":"IF(M6<>\"\",M6+1,IF(WEEKDAY(M4)=3,M4,\"\"))","v":"2010-02-02"},{"$f":"IF(N6<>\"\",N6+1,IF(WEEKDAY(M4)=4,M4,\"\"))","v":"2010-02-03"},{"$f":"IF(O6<>\"\",O6+1,IF(WEEKDAY(M4)=5,M4,\"\"))","v":"2010-02-04"},{"$f":"IF(P6<>\"\",P6+1,IF(WEEKDAY(M4)=6,M4,\"\"))","v":"2010-02-05"},{"$f":"IF(Q6<>\"\",Q6+1,IF(WEEKDAY(M4)=7,M4,\"\"))","v":"2010-02-06"},{"$f":"IF(R6<>\"\",R6+1,IF(WEEKDAY(M4)=1,M4,\"\"))","v":"2010-02-07"},{"$f":"IF(S6=\"\",\"\",WEEKNUM(S6,2))","v":6},{"$f":"IF(AB6=\"\",\"\",WEEKNUM(AB6,1))","v":10},null,{"$f":"IF(WEEKDAY(W4)=2,W4,\"\")","v":"2010-03-01"},{"$f":"IF(W6<>\"\",W6+1,IF(WEEKDAY(W4)=3,W4,\"\"))","v":"2010-03-02"},{"$f":"IF(X6<>\"\",X6+1,IF(WEEKDAY(W4)=4,W4,\"\"))","v":"2010-03-03"},{"$f":"IF(Y6<>\"\",Y6+1,IF(WEEKDAY(W4)=5,W4,\"\"))","v":"2010-03-04"},{"$f":"IF(Z6<>\"\",Z6+1,IF(WEEKDAY(W4)=6,W4,\"\"))","v":"2010-03-05"},{"$f":"IF(AA6<>\"\",AA6+1,IF(WEEKDAY(W4)=7,W4,\"\"))","v":"2010-03-06"},{"$f":"IF(AB6<>\"\",AB6+1,IF(WEEKDAY(W4)=1,W4,\"\"))","v":"2010-03-07"},{"$f":"IF(AC6=\"\",\"\",WEEKNUM(AC6,2))","v":10}]
[{"$f":"WEEKNUM(B7,1)","v":2},{"$f":"I6","v":"2010-01-03"},{"$f":"I6+1","v":"2010-01-04"},{"$f":"C7+1","v":"2010-01-05"},"2010-01-06","2010-01-07","2010-01-08","2010-01-09","2010-01-10",{"$f":"WEEKNUM(C7,2)","v":2},{"$f":"WEEKNUM(L7,1)","v":7},{"$f":"S6","v":"2010-02-07"},{"$f":"S6+1","v":"2010-02-08"},{"$f":"M7+1","v":"2010-02-09"},"2010-02-10","2010-02-11","2010-02-12","2010-02-13","2010-02-14",{"$f":"WEEKNUM(M7,2)","v":7},{"$f":"WEEKNUM(V7,1)","v":11},{"$f":"AC6","v":"2010-03-07"},{"$f":"AC6+1","v":"2010-03-08"},{"$f":"W7+1","v":"2010-03-09"},"2010-03-10","2010-03-11","2010-03-12","2010-03-13","2010-03-14",{"$f":"WEEKNUM(W7,2)","v":11}]
[{"$f":"WEEKNUM(B8,1)","v":3},{"$f":"I7","v":"2010-01-10"},{"$f":"I7+1","v":"2010-01-11"},"2010-01-12","2010-01-13","2010-01-14","2010-01-15","2010-01-16","2010-01-17",{"$f":"WEEKNUM(C8,2)","v":3},{"$f":"WEEKNUM(L8,1)","v":8},{"$f":"S7","v":"2010-02-14"},{"$f":"S7+1","v":"2010-02-15"},"2010-02-16","2010-02-17","2010-02-18","2010-02-19","2010-02-20","2010-02-21",{"$f":"WEEKNUM(M8,2)","v":8},{"$f":"WEEKNUM(V8,1)","v":12},{"$f":"AC7","v":"2010-03-14"},{"$f":"AC7+1","v":"2010-03-15"},"2010-03-16","2010-03-17","2010-03-18","2010-03-19","2010-03-20","2010-03-21",{"$f":"WEEKNUM(W8,2)","v":12}]
[{"$f":"WEEKNUM(B9,1)","v":4},{"$f":"I8","v":"2010-01-17"},{"$f":"I8+1","v":"2010-01-18"},"2010-01-19","2010-01-20","2010-01-21","2010-01-22","2010-01-23","2010-01-24",{"$f":"WEEKNUM(C9,2)","v":4},{"$f":"WEEKNUM(L9,1)","v":9},{"$f":"S8","v":"2010-02-21"},{"$f":"S8+1","v":"2010-02-22"},"2010-02-23","2010-02-24","2010-02-25","2010-02-26","2010-02-27","2010-02-28",{"$f":"WEEKNUM(M9,2)","v":9},{"$f":"WEEKNUM(V9,1)","v":13},{"$f":"AC8","v":"2010-03-21"},{"$f":"AC8+1","v":"2010-03-22"},"2010-03-23","2010-03-24","2010-03-25","2010-03-26","2010-03-27","2010-03-28",{"$f":"WEEKNUM(W9,2)","v":13}]
[{"$f":"IF(B10=\"\",\"\",WEEKNUM(B10,1))","v":5},{"$f":"I9","v":"2010-01-24"},{"$f":"IF(I9<EOMONTH(C4,0),I9+1,\"\")","v":"2010-01-25"},{"$f":"IF(C10<EOMONTH(C4,0),C10+1,\"\")","v":"2010-01-26"},{"$f":"IF(D10<EOMONTH(C4,0),D10+1,\"\")","v":"2010-01-27"},{"$f":"IF(E10<EOMONTH(C4,0),E10+1,\"\")","v":"2010-01-28"},{"$f":"IF(F10<EOMONTH(C4,0),F10+1,\"\")","v":"2010-01-29"},{"$f":"IF(G10<EOMONTH(C4,0),G10+1,\"\")","v":"2010-01-30"},{"$f":"IF(H10<EOMONTH(C4,0),H10+1,\"\")","v":"2010-01-31"},{"$f":"IF(C10=\"\",\"\",WEEKNUM(C10,2))","v":5},{"$f":"IF(L10=\"\",\"\",WEEKNUM(L10,1))","v":10},{"$f":"S9","v":"2010-02-28"},{"$f":"IF(S9<EOMONTH(M4,0),S9+1,\"\")","v":""},{"$f":"IF(M10<EOMONTH(M4,0),M10+1,\"\")","v":""},{"$f":"IF(N10<EOMONTH(M4,0),N10+1,\"\")","v":""},{"$f":"IF(O10<EOMONTH(M4,0),O10+1,\"\")","v":""},{"$f":"IF(P10<EOMONTH(M4,0),P10+1,\"\")","v":""},{"$f":"IF(Q10<EOMONTH(M4,0),Q10+1,\"\")","v":""},{"$f":"IF(R10<EOMONTH(M4,0),R10+1,\"\")","v":""},{"$f":"IF(M10=\"\",\"\",WEEKNUM(M10,2))","v":""},{"$f":"IF(V10=\"\",\"\",WEEKNUM(V10,1))","v":14},{"$f":"AC9","v":"2010-03-28"},{"$f":"IF(AC9<EOMONTH(W4,0),AC9+1,\"\")","v":"2010-03-29"},{"$f":"IF(W10<EOMONTH(W4,0),W10+1,\"\")","v":"2010-03-30"},{"$f":"IF(X10<EOMONTH(W4,0),X10+1,\"\")","v":"2010-03-31"},{"$f":"IF(Y10<EOMONTH(W4,0),Y10+1,\"\")","v":""},{"$f":"IF(Z10<EOMONTH(W4,0),Z10+1,\"\")","v":""},{"$f":"IF(AA10<EOMONTH(W4,0),AA10+1,\"\")","v":""},{"$f":"IF(AB10<EOMONTH(W4,0),AB10+1,\"\")","v":""},{"$f":"IF(W10=\"\",\"\",WEEKNUM(W10,2))","v":14}]
[{"$f":"IF(B11=\"\",\"\",WEEKNUM(B11,1))","v":6},{"$f":"I10","v":"2010-01-31"},{"$f":"IF(I10<EOMONTH(C4,0),I10+1,\"\")","v":""},{"$f":"IF(C11<EOMONTH(C4,0),C11+1,\"\")","v":""},null,null,null,null,null,{"$f":"IF(C11=\"\",\"\",WEEKNUM(C11,2))","v":""},{"$f":"IF(L11=\"\",\"\",WEEKNUM(L11,1))","v":""},{"$f":"S10","v":""},{"$f":"IF(S10<EOMONTH(M4,0),S10+1,\"\")","v":""},{"$f":"IF(M11<EOMONTH(M4,0),M11+1,\"\")","v":""},null,null,null,null,null,{"$f":"IF(M11=\"\",\"\",WEEKNUM(M11,2))","v":""},{"$f":"IF(V11=\"\",\"\",WEEKNUM(V11,1))","v":""},{"$f":"AC10","v":""},{"$f":"IF(AC10<EOMONTH(W4,0),AC10+1,\"\")","v":""},{"$f":"IF(W11<EOMONTH(W4,0),W11+1,\"\")","v":""},null,null,null,null,null,{"$f":"IF(W11=\"\",\"\",WEEKNUM(W11,2))","v":""}]
[]
[null,{"$f":"MONTH($C13)","v":4},{"$f":"DATE($M$3,4,1)","v":"2010-04-01"},null,null,null,null,null,{"$f":"MONTH($C13)","v":4},null,null,{"$f":"MONTH($M13)","v":5},{"$f":"DATE($M$3,5,1)","v":"2010-05-01"},null,null,null,null,null,{"$f":"MONTH($M13)","v":5},null,null,{"$f":"MONTH($W13)","v":6},{"$f":"DATE($M$3,6,1)","v":"2010-06-01"},null,null,null,null,null,{"$f":"MONTH($W13)","v":6}]
[null,{"$f":"C14-1","v":"2010-01-31"},{"$f":"DATE(2010,2,1)","v":"2010-02-01"},{"$f":"C14+1","v":"2010-02-02"},"2010-02-03","2010-02-04","2010-02-05","2010-02-06","2010-02-07",null,null,{"$f":"M14-1","v":"2010-01-31"},{"$f":"DATE(2010,2,1)","v":"2010-02-01"},{"$f":"M14+1","v":"2010-02-02"},"2010-02-03","2010-02-04","2010-02-05","2010-02-06","2010-02-07",null,null,{"$f":"W14-1","v":"2010-01-31"},{"$f":"DATE(2010,2,1)","v":"2010-02-01"},{"$f":"W14+1","v":"2010-02-02"},"2010-02-03","2010-02-04","2010-02-05","2010-02-06","2010-02-07"]
[{"$f":"IF(H15=\"\",\"\",WEEKNUM(H15,1))","v":14},null,{"$f":"IF(WEEKDAY(C13)=2,C13,\"\")","v":""},{"$f":"IF(C15<>\"\",C15+1,IF(WEEKDAY(C13)=3,C13,\"\"))","v":""},{"$f":"IF(D15<>\"\",D15+1,IF(WEEKDAY(C13)=4,C13,\"\"))","v":""},{"$f":"IF(E15<>\"\",E15+1,IF(WEEKDAY(C13)=5,C13,\"\"))","v":"2010-04-01"},{"$f":"IF(F15<>\"\",F15+1,IF(WEEKDAY(C13)=6,C13,\"\"))","v":"2010-04-02"},{"$f":"IF(G15<>\"\",G15+1,IF(WEEKDAY(C13)=7,C13,\"\"))","v":"2010-04-03"},{"$f":"IF(H15<>\"\",H15+1,IF(WEEKDAY(C13)=1,C13,\"\"))","v":"2010-04-04"},{"$f":"IF(I15=\"\",\"\",WEEKNUM(I15,2))","v":14},{"$f":"IF(R15=\"\",\"\",WEEKNUM(R15,1))","v":18},null,{"$f":"IF(WEEKDAY(M13)=2,M13,\"\")","v":""},{"$f":"IF(M15<>\"\",M15+1,IF(WEEKDAY(M13)=3,M13,\"\"))","v":""},{"$f":"IF(N15<>\"\",N15+1,IF(WEEKDAY(M13)=4,M13,\"\"))","v":""},{"$f":"IF(O15<>\"\",O15+1,IF(WEEKDAY(M13)=5,M13,\"\"))","v":""},{"$f":"IF(P15<>\"\",P15+1,IF(WEEKDAY(M13)=6,M13,\"\"))","v":""},{"$f":"IF(Q15<>\"\",Q15+1,IF(WEEKDAY(M13)=7,M13,\"\"))","v":"2010-05-01"},{"$f":"IF(R15<>\"\",R15+1,IF(WEEKDAY(M13)=1,M13,\"\"))","v":"2010-05-02"},{"$f":"IF(S15=\"\",\"\",WEEKNUM(S15,2))","v":18},{"$f":"IF(AB15=\"\",\"\",WEEKNUM(AB15,1))","v":23},null,{"$f":"IF(WEEKDAY(W13)=2,W13,\"\")","v":""},{"$f":"IF(W15<>\"\",W15+1,IF(WEEKDAY(W13)=3,W13,\"\"))","v":"2010-06-01"},{"$f":"IF(X15<>\"\",X15+1,IF(WEEKDAY(W13)=4,W13,\"\"))","v":"2010-06-02"},{"$f":"IF(Y15<>\"\",Y15+1,IF(WEEKDAY(W13)=5,W13,\"\"))","v":"2010-06-03"},{"$f":"IF(Z15<>\"\",Z15+1,IF(WEEKDAY(W13)=6,W13,\"\"))","v":"2010-06-04"},{"$f":"IF(AA15<>\"\",AA15+1,IF(WEEKDAY(W13)=7,W13,\"\"))","v":"2010-06-05"},{"$f":"IF(AB15<>\"\",AB15+1,IF(WEEKDAY(W13)=1,W13,\"\"))","v":"2010-06-06"},{"$f":"IF(AC15=\"\",\"\",WEEKNUM(AC15,2))","v":23}]
[{"$f":"WEEKNUM(B16,1)","v":15},{"$f":"I15","v":"2010-04-04"},{"$f":"I15+1","v":"2010-04-05"},{"$f":"C16+1","v":"2010-04-06"},"2010-04-07","2010-04-08","2010-04-09","2010-04-10","2010-04-11",{"$f":"WEEKNUM(C16,2)","v":15},{"$f":"WEEKNUM(L16,1)","v":19},{"$f":"S15","v":"2010-05-02"},{"$f":"S15+1","v":"2010-05-03"},{"$f":"M16+1","v":"2010-05-04"},"2010-05-05","2010-05-06","2010-05-07","2010-05-08","2010-05-09",{"$f":"WEEKNUM(M16,2)","v":19},{"$f":"WEEKNUM(V16,1)","v":24},{"$f":"AC15","v":"2010-06-06"},{"$f":"AC15+1","v":"2010-06-07"},{"$f":"W16+1","v":"2010-06-08"},"2010-06-09","2010-06-10","2010-06-11","2010-06-12","2010-06-13",{"$f":"WEEKNUM(W16,2)","v":24}]
[{"$f":"WEEKNUM(B17,1)","v":16},{"$f":"I16","v":"2010-04-11"},{"$f":"I16+1","v":"2010-04-12"},"2010-04-13","2010-04-14","2010-04-15","2010-04-16","2010-04-17","2010-04-18",{"$f":"WEEKNUM(C17,2)","v":16},{"$f":"WEEKNUM(L17,1)","v":20},{"$f":"S16","v":"2010-05-09"},{"$f":"S16+1","v":"2010-05-10"},"2010-05-11","2010-05-12","2010-05-13","2010-05-14","2010-05-15","2010-05-16",{"$f":"WEEKNUM(M17,2)","v":20},{"$f":"WEEKNUM(V17,1)","v":25},{"$f":"AC16","v":"2010-06-13"},{"$f":"AC16+1","v":"2010-06-14"},"2010-06-15","2010-06-16","2010-06-17","2010-06-18","2010-06-19","2010-06-20",{"$f":"WEEKNUM(W17,2)","v":25}]
[{"$f":"WEEKNUM(B18,1)","v":17},{"$f":"I17","v":"2010-04-18"},{"$f":"I17+1","v":"2010-04-19"},"2010-04-20","2010-04-21","2010-04-22","2010-04-23","2010-04-24","2010-04-25",{"$f":"WEEKNUM(C18,2)","v":17},{"$f":"WEEKNUM(L18,1)","v":21},{"$f":"S17","v":"2010-05-16"},{"$f":"S17+1","v":"2010-05-17"},"2010-05-18","2010-05-19","2010-05-20","2010-05-21","2010-05-22","2010-05-23",{"$f":"WEEKNUM(M18,2)","v":21},{"$f":"WEEKNUM(V18,1)","v":26},{"$f":"AC17","v":"2010-06-20"},{"$f":"AC17+1","v":"2010-06-21"},"2010-06-22","2010-06-23","2010-06-24","2010-06-25","2010-06-26","2010-06-27",{"$f":"WEEKNUM(W18,2)","v":26}]
[{"$f":"IF(B19=\"\",\"\",WEEKNUM(B19,1))","v":18},{"$f":"I18","v":"2010-04-25"},{"$f":"IF(I18<EOMONTH(C13,0),I18+1,\"\")","v":"2010-04-26"},{"$f":"IF(C19<EOMONTH(C13,0),C19+1,\"\")","v":"2010-04-27"},{"$f":"IF(D19<EOMONTH(C13,0),D19+1,\"\")","v":"2010-04-28"},{"$f":"IF(E19<EOMONTH(C13,0),E19+1,\"\")","v":"2010-04-29"},{"$f":"IF(F19<EOMONTH(C13,0),F19+1,\"\")","v":"2010-04-30"},{"$f":"IF(G19<EOMONTH(C13,0),G19+1,\"\")","v":""},{"$f":"IF(H19<EOMONTH(C13,0),H19+1,\"\")","v":""},{"$f":"IF(C19=\"\",\"\",WEEKNUM(C19,2))","v":18},{"$f":"IF(L19=\"\",\"\",WEEKNUM(L19,1))","v":22},{"$f":"S18","v":"2010-05-23"},{"$f":"IF(S18<EOMONTH(M13,0),S18+1,\"\")","v":"2010-05-24"},{"$f":"IF(M19<EOMONTH(M13,0),M19+1,\"\")","v":"2010-05-25"},{"$f":"IF(N19<EOMONTH(M13,0),N19+1,\"\")","v":"2010-05-26"},{"$f":"IF(O19<EOMONTH(M13,0),O19+1,\"\")","v":"2010-05-27"},{"$f":"IF(P19<EOMONTH(M13,0),P19+1,\"\")","v":"2010-05-28"},{"$f":"IF(Q19<EOMONTH(M13,0),Q19+1,\"\")","v":"2010-05-29"},{"$f":"IF(R19<EOMONTH(M13,0),R19+1,\"\")","v":"2010-05-30"},{"$f":"IF(M19=\"\",\"\",WEEKNUM(M19,2))","v":22},{"$f":"IF(V19=\"\",\"\",WEEKNUM(V19,1))","v":27},{"$f":"AC18","v":"2010-06-27"},{"$f":"IF(AC18<EOMONTH(W13,0),AC18+1,\"\")","v":"2010-06-28"},{"$f":"IF(W19<EOMONTH(W13,0),W19+1,\"\")","v":"2010-06-29"},{"$f":"IF(X19<EOMONTH(W13,0),X19+1,\"\")","v":"2010-06-30"},{"$f":"IF(Y19<EOMONTH(W13,0),Y19+1,\"\")","v":""},{"$f":"IF(Z19<EOMONTH(W13,0),Z19+1,\"\")","v":""},{"$f":"IF(AA19<EOMONTH(W13,0),AA19+1,\"\")","v":""},{"$f":"IF(AB19<EOMONTH(W13,0),AB19+1,\"\")","v":""},{"$f":"IF(W19=\"\",\"\",WEEKNUM(W19,2))","v":27}]
[{"$f":"IF(B20=\"\",\"\",WEEKNUM(B20,1))","v":""},{"$f":"I19","v":""},{"$f":"IF(I19<EOMONTH(C13,0),I19+1,\"\")","v":""},{"$f":"IF(C20<EOMONTH(C13,0),C20+1,\"\")","v":""},null,null,null,null,null,{"$f":"IF(C20=\"\",\"\",WEEKNUM(C20,2))","v":""},{"$f":"IF(L20=\"\",\"\",WEEKNUM(L20,1))","v":23},{"$f":"S19","v":"2010-05-30"},{"$f":"IF(S19<EOMONTH(M13,0),S19+1,\"\")","v":"2010-05-31"},{"$f":"IF(M20<EOMONTH(M13,0),M20+1,\"\")","v":""},null,null,null,null,null,{"$f":"IF(M20=\"\",\"\",WEEKNUM(M20,2))","v":23},{"$f":"IF(V20=\"\",\"\",WEEKNUM(V20,1))","v":""},{"$f":"AC19","v":""},{"$f":"IF(AC19<EOMONTH(W13,0),AC19+1,\"\")","v":""},{"$f":"IF(W20<EOMONTH(W13,0),W20+1,\"\")","v":""},null,null,null,null,null,{"$f":"IF(W20=\"\",\"\",WEEKNUM(W20,2))","v":""}]
[]
[null,{"$f":"MONTH($C22)","v":7},{"$f":"DATE($M$3,7,1)","v":"2010-07-01"},null,null,null,null,null,{"$f":"MONTH($C22)","v":7},null,null,{"$f":"MONTH($M22)","v":8},{"$f":"DATE($M$3,8,1)","v":"2010-08-01"},null,null,null,null,null,{"$f":"MONTH($M22)","v":8},null,null,{"$f":"MONTH($W22)","v":9},{"$f":"DATE($M$3,9,1)","v":"2010-09-01"},null,null,null,null,null,{"$f":"MONTH($W22)","v":9}]
[null,{"$f":"C23-1","v":"2010-01-31"},{"$f":"DATE(2010,2,1)","v":"2010-02-01"},{"$f":"C23+1","v":"2010-02-02"},"2010-02-03","2010-02-04","2010-02-05","2010-02-06","2010-02-07",null,null,{"$f":"M23-1","v":"2010-01-31"},{"$f":"DATE(2010,2,1)","v":"2010-02-01"},{"$f":"M23+1","v":"2010-02-02"},"2010-02-03","2010-02-04","2010-02-05","2010-02-06","2010-02-07",null,null,{"$f":"W23-1","v":"2010-01-31"},{"$f":"DATE(2010,2,1)","v":"2010-02-01"},{"$f":"W23+1","v":"2010-02-02"},"2010-02-03","2010-02-04","2010-02-05","2010-02-06","2010-02-07"]
[{"$f":"IF(H24=\"\",\"\",WEEKNUM(H24,1))","v":27},null,{"$f":"IF(WEEKDAY(C22)=2,C22,\"\")","v":""},{"$f":"IF(C24<>\"\",C24+1,IF(WEEKDAY(C22)=3,C22,\"\"))","v":""},{"$f":"IF(D24<>\"\",D24+1,IF(WEEKDAY(C22)=4,C22,\"\"))","v":""},{"$f":"IF(E24<>\"\",E24+1,IF(WEEKDAY(C22)=5,C22,\"\"))","v":"2010-07-01"},{"$f":"IF(F24<>\"\",F24+1,IF(WEEKDAY(C22)=6,C22,\"\"))","v":"2010-07-02"},{"$f":"IF(G24<>\"\",G24+1,IF(WEEKDAY(C22)=7,C22,\"\"))","v":"2010-07-03"},{"$f":"IF(H24<>\"\",H24+1,IF(WEEKDAY(C22)=1,C22,\"\"))","v":"2010-07-04"},{"$f":"IF(I24=\"\",\"\",WEEKNUM(I24,2))","v":27},{"$f":"IF(R24=\"\",\"\",WEEKNUM(R24,1))","v":""},null,{"$f":"IF(WEEKDAY(M22)=2,M22,\"\")","v":""},{"$f":"IF(M24<>\"\",M24+1,IF(WEEKDAY(M22)=3,M22,\"\"))","v":""},{"$f":"IF(N24<>\"\",N24+1,IF(WEEKDAY(M22)=4,M22,\"\"))","v":""},{"$f":"IF(O24<>\"\",O24+1,IF(WEEKDAY(M22)=5,M22,\"\"))","v":""},{"$f":"IF(P24<>\"\",P24+1,IF(WEEKDAY(M22)=6,M22,\"\"))","v":""},{"$f":"IF(Q24<>\"\",Q24+1,IF(WEEKDAY(M22)=7,M22,\"\"))","v":""},{"$f":"IF(R24<>\"\",R24+1,IF(WEEKDAY(M22)=1,M22,\"\"))","v":"2010-08-01"},{"$f":"IF(S24=\"\",\"\",WEEKNUM(S24,2))","v":31},{"$f":"IF(AB24=\"\",\"\",WEEKNUM(AB24,1))","v":36},null,{"$f":"IF(WEEKDAY(W22)=2,W22,\"\")","v":""},{"$f":"IF(W24<>\"\",W24+1,IF(WEEKDAY(W22)=3,W22,\"\"))","v":""},{"$f":"IF(X24<>\"\",X24+1,IF(WEEKDAY(W22)=4,W22,\"\"))","v":"2010-09-01"},{"$f":"IF(Y24<>\"\",Y24+1,IF(WEEKDAY(W22)=5,W22,\"\"))","v":"2010-09-02"},{"$f":"IF(Z24<>\"\",Z24+1,IF(WEEKDAY(W22)=6,W22,\"\"))","v":"2010-09-03"},{"$f":"IF(AA24<>\"\",AA24+1,IF(WEEKDAY(W22)=7,W22,\"\"))","v":"2010-09-04"},{"$f":"IF(AB24<>\"\",AB24+1,IF(WEEKDAY(W22)=1,W22,\"\"))","v":"2010-09-05"},{"$f":"IF(AC24=\"\",\"\",WEEKNUM(AC24,2))","v":36}]
[{"$f":"WEEKNUM(B25,1)","v":28},{"$f":"I24","v":"2010-07-04"},{"$f":"I24+1","v":"2010-07-05"},{"$f":"C25+1","v":"2010-07-06"},"2010-07-07","2010-07-08","2010-07-09","2010-07-10","2010-07-11",{"$f":"WEEKNUM(C25,2)","v":28},{"$f":"WEEKNUM(L25,1)","v":32},{"$f":"S24","v":"2010-08-01"},{"$f":"S24+1","v":"2010-08-02"},{"$f":"M25+1","v":"2010-08-03"},"2010-08-04","2010-08-05","2010-08-06","2010-08-07","2010-08-08",{"$f":"WEEKNUM(M25,2)","v":32},{"$f":"WEEKNUM(V25,1)","v":37},{"$f":"AC24","v":"2010-09-05"},{"$f":"AC24+1","v":"2010-09-06"},{"$f":"W25+1","v":"2010-09-07"},"2010-09-08","2010-09-09","2010-09-10","2010-09-11","2010-09-12",{"$f":"WEEKNUM(W25,2)","v":37}]
[{"$f":"WEEKNUM(B26,1)","v":29},{"$f":"I25","v":"2010-07-11"},{"$f":"I25+1","v":"2010-07-12"},"2010-07-13","2010-07-14","2010-07-15","2010-07-16","2010-07-17","2010-07-18",{"$f":"WEEKNUM(C26,2)","v":29},{"$f":"WEEKNUM(L26,1)","v":33},{"$f":"S25","v":"2010-08-08"},{"$f":"S25+1","v":"2010-08-09"},"2010-08-10","2010-08-11","2010-08-12","2010-08-13","2010-08-14","2010-08-15",{"$f":"WEEKNUM(M26,2)","v":33},{"$f":"WEEKNUM(V26,1)","v":38},{"$f":"AC25","v":"2010-09-12"},{"$f":"AC25+1","v":"2010-09-13"},"2010-09-14","2010-09-15","2010-09-16","2010-09-17","2010-09-18","2010-09-19",{"$f":"WEEKNUM(W26,2)","v":38}]
[{"$f":"WEEKNUM(B27,1)","v":30},{"$f":"I26","v":"2010-07-18"},{"$f":"I26+1","v":"2010-07-19"},"2010-07-20","2010-07-21","2010-07-22","2010-07-23","2010-07-24","2010-07-25",{"$f":"WEEKNUM(C27,2)","v":30},{"$f":"WEEKNUM(L27,1)","v":34},{"$f":"S26","v":"2010-08-15"},{"$f":"S26+1","v":"2010-08-16"},"2010-08-17","2010-08-18","2010-08-19","2010-08-20","2010-08-21","2010-08-22",{"$f":"WEEKNUM(M27,2)","v":34},{"$f":"WEEKNUM(V27,1)","v":39},{"$f":"AC26","v":"2010-09-19"},{"$f":"AC26+1","v":"2010-09-20"},"2010-09-21","2010-09-22","2010-09-23","2010-09-24","2010-09-25","2010-09-26",{"$f":"WEEKNUM(W27,2)","v":39}]
[{"$f":"IF(B28=\"\",\"\",WEEKNUM(B28,1))","v":31},{"$f":"I27","v":"2010-07-25"},{"$f":"IF(I27<EOMONTH(C22,0),I27+1,\"\")","v":"2010-07-26"},{"$f":"IF(C28<EOMONTH(C22,0),C28+1,\"\")","v":"2010-07-27"},{"$f":"IF(D28<EOMONTH(C22,0),D28+1,\"\")","v":"2010-07-28"},{"$f":"IF(E28<EOMONTH(C22,0),E28+1,\"\")","v":"2010-07-29"},{"$f":"IF(F28<EOMONTH(C22,0),F28+1,\"\")","v":"2010-07-30"},{"$f":"IF(G28<EOMONTH(C22,0),G28+1,\"\")","v":"2010-07-31"},{"$f":"IF(H28<EOMONTH(C22,0),H28+1,\"\")","v":""},{"$f":"IF(C28=\"\",\"\",WEEKNUM(C28,2))","v":31},{"$f":"IF(L28=\"\",\"\",WEEKNUM(L28,1))","v":35},{"$f":"S27","v":"2010-08-22"},{"$f":"IF(S27<EOMONTH(M22,0),S27+1,\"\")","v":"2010-08-23"},{"$f":"IF(M28<EOMONTH(M22,0),M28+1,\"\")","v":"2010-08-24"},{"$f":"IF(N28<EOMONTH(M22,0),N28+1,\"\")","v":"2010-08-25"},{"$f":"IF(O28<EOMONTH(M22,0),O28+1,\"\")","v":"2010-08-26"},{"$f":"IF(P28<EOMONTH(M22,0),P28+1,\"\")","v":"2010-08-27"},{"$f":"IF(Q28<EOMONTH(M22,0),Q28+1,\"\")","v":"2010-08-28"},{"$f":"IF(R28<EOMONTH(M22,0),R28+1,\"\")","v":"2010-08-29"},{"$f":"IF(M28=\"\",\"\",WEEKNUM(M28,2))","v":35},{"$f":"IF(V28=\"\",\"\",WEEKNUM(V28,1))","v":40},{"$f":"AC27","v":"2010-09-26"},{"$f":"IF(AC27<EOMONTH(W22,0),AC27+1,\"\")","v":"2010-09-27"},{"$f":"IF(W28<EOMONTH(W22,0),W28+1,\"\")","v":"2010-09-28"},{"$f":"IF(X28<EOMONTH(W22,0),X28+1,\"\")","v":"2010-09-29"},{"$f":"IF(Y28<EOMONTH(W22,0),Y28+1,\"\")","v":"2010-09-30"},{"$f":"IF(Z28<EOMONTH(W22,0),Z28+1,\"\")","v":""},{"$f":"IF(AA28<EOMONTH(W22,0),AA28+1,\"\")","v":""},{"$f":"IF(AB28<EOMONTH(W22,0),AB28+1,\"\")","v":""},{"$f":"IF(W28=\"\",\"\",WEEKNUM(W28,2))","v":40}]
[{"$f":"IF(B29=\"\",\"\",WEEKNUM(B29,1))","v":""},{"$f":"I28","v":""},{"$f":"IF(I28<EOMONTH(C22,0),I28+1,\"\")","v":""},{"$f":"IF(C29<EOMONTH(C22,0),C29+1,\"\")","v":""},null,null,null,null,null,{"$f":"IF(C29=\"\",\"\",WEEKNUM(C29,2))","v":""},{"$f":"IF(L29=\"\",\"\",WEEKNUM(L29,1))","v":36},{"$f":"S28","v":"2010-08-29"},{"$f":"IF(S28<EOMONTH(M22,0),S28+1,\"\")","v":"2010-08-30"},{"$f":"IF(M29<EOMONTH(M22,0),M29+1,\"\")","v":"2010-08-31"},null,null,null,null,null,{"$f":"IF(M29=\"\",\"\",WEEKNUM(M29,2))","v":36},{"$f":"IF(V29=\"\",\"\",WEEKNUM(V29,1))","v":""},{"$f":"AC28","v":""},{"$f":"IF(AC28<EOMONTH(W22,0),AC28+1,\"\")","v":""},{"$f":"IF(W29<EOMONTH(W22,0),W29+1,\"\")","v":""},null,null,null,null,null,{"$f":"IF(W29=\"\",\"\",WEEKNUM(W29,2))","v":""}]
[]
[null,{"$f":"MONTH($C31)","v":10},{"$f":"DATE($M$3,10,1)","v":"2010-10-01"},null,null,null,null,null,{"$f":"MONTH($C31)","v":10},null,null,{"$f":"MONTH($M31)","v":11},{"$f":"DATE($M$3,11,1)","v":"2010-11-01"},null,null,null,null,null,{"$f":"MONTH($M31)","v":11},null,null,{"$f":"MONTH($W31)","v":12},{"$f":"DATE($M$3,12,1)","v":"2010-12-01"},null,null,null,null,null,{"$f":"MONTH($W31)","v":12}]
[null,{"$f":"C32-1","v":"2010-01-31"},{"$f":"DATE(2010,2,1)","v":"2010-02-01"},{"$f":"C32+1","v":"2010-02-02"},"2010-02-03","2010-02-04","2010-02-05","2010-02-06","2010-02-07",null,null,{"$f":"M32-1","v":"2010-01-31"},{"$f":"DATE(2010,2,1)","v":"2010-02-01"},{"$f":"M32+1","v":"2010-02-02"},"2010-02-03","2010-02-04","2010-02-05","2010-02-06","2010-02-07",null,null,{"$f":"W32-1","v":"2010-01-31"},{"$f":"DATE(2010,2,1)","v":"2010-02-01"},{"$f":"W32+1","v":"2010-02-02"},"2010-02-03","2010-02-04","2010-02-05","2010-02-06","2010-02-07"]
[{"$f":"IF(H33=\"\",\"\",WEEKNUM(H33,1))","v":40},null,{"$f":"IF(WEEKDAY(C31)=2,C31,\"\")","v":""},{"$f":"IF(C33<>\"\",C33+1,IF(WEEKDAY(C31)=3,C31,\"\"))","v":""},{"$f":"IF(D33<>\"\",D33+1,IF(WEEKDAY(C31)=4,C31,\"\"))","v":""},{"$f":"IF(E33<>\"\",E33+1,IF(WEEKDAY(C31)=5,C31,\"\"))","v":""},{"$f":"IF(F33<>\"\",F33+1,IF(WEEKDAY(C31)=6,C31,\"\"))","v":"2010-10-01"},{"$f":"IF(G33<>\"\",G33+1,IF(WEEKDAY(C31)=7,C31,\"\"))","v":"2010-10-02"},{"$f":"IF(H33<>\"\",H33+1,IF(WEEKDAY(C31)=1,C31,\"\"))","v":"2010-10-03"},{"$f":"IF(I33=\"\",\"\",WEEKNUM(I33,2))","v":40},{"$f":"IF(R33=\"\",\"\",WEEKNUM(R33,1))","v":45},null,{"$f":"IF(WEEKDAY(M31)=2,M31,\"\")","v":"2010-11-01"},{"$f":"IF(M33<>\"\",M33+1,IF(WEEKDAY(M31)=3,M31,\"\"))","v":"2010-11-02"},{"$f":"IF(N33<>\"\",N33+1,IF(WEEKDAY(M31)=4,M31,\"\"))","v":"2010-11-03"},{"$f":"IF(O33<>\"\",O33+1,IF(WEEKDAY(M31)=5,M31,\"\"))","v":"2010-11-04"},{"$f":"IF(P33<>\"\",P33+1,IF(WEEKDAY(M31)=6,M31,\"\"))","v":"2010-11-05"},{"$f":"IF(Q33<>\"\",Q33+1,IF(WEEKDAY(M31)=7,M31,\"\"))","v":"2010-11-06"},{"$f":"IF(R33<>\"\",R33+1,IF(WEEKDAY(M31)=1,M31,\"\"))","v":"2010-11-07"},{"$f":"IF(S33=\"\",\"\",WEEKNUM(S33,2))","v":45},{"$f":"IF(AB33=\"\",\"\",WEEKNUM(AB33,1))","v":49},null,{"$f":"IF(WEEKDAY(W31)=2,W31,\"\")","v":""},{"$f":"IF(W33<>\"\",W33+1,IF(WEEKDAY(W31)=3,W31,\"\"))","v":""},{"$f":"IF(X33<>\"\",X33+1,IF(WEEKDAY(W31)=4,W31,\"\"))","v":"2010-12-01"},{"$f":"IF(Y33<>\"\",Y33+1,IF(WEEKDAY(W31)=5,W31,\"\"))","v":"2010-12-02"},{"$f":"IF(Z33<>\"\",Z33+1,IF(WEEKDAY(W31)=6,W31,\"\"))","v":"2010-12-03"},{"$f":"IF(AA33<>\"\",AA33+1,IF(WEEKDAY(W31)=7,W31,\"\"))","v":"2010-12-04"},{"$f":"IF(AB33<>\"\",AB33+1,IF(WEEKDAY(W31)=1,W31,\"\"))","v":"2010-12-05"},{"$f":"IF(AC33=\"\",\"\",WEEKNUM(AC33,2))","v":49}]
[{"$f":"WEEKNUM(B34,1)","v":41},{"$f":"I33","v":"2010-10-03"},{"$f":"I33+1","v":"2010-10-04"},{"$f":"C34+1","v":"2010-10-05"},"2010-10-06","2010-10-07","2010-10-08","2010-10-09","2010-10-10",{"$f":"WEEKNUM(C34,2)","v":41},{"$f":"WEEKNUM(L34,1)","v":46},{"$f":"S33","v":"2010-11-07"},{"$f":"S33+1","v":"2010-11-08"},{"$f":"M34+1","v":"2010-11-09"},"2010-11-10","2010-11-11","2010-11-12","2010-11-13","2010-11-14",{"$f":"WEEKNUM(M34,2)","v":46},{"$f":"WEEKNUM(V34,1)","v":50},{"$f":"AC33","v":"2010-12-05"},{"$f":"AC33+1","v":"2010-12-06"},{"$f":"W34+1","v":"2010-12-07"},"2010-12-08","2010-12-09","2010-12-10","2010-12-11","2010-12-12",{"$f":"WEEKNUM(W34,2)","v":50}]
[{"$f":"WEEKNUM(B35,1)","v":42},{"$f":"I34","v":"2010-10-10"},{"$f":"I34+1","v":"2010-10-11"},"2010-10-12","2010-10-13","2010-10-14","2010-10-15","2010-10-16","2010-10-17",{"$f":"WEEKNUM(C35,2)","v":42},{"$f":"WEEKNUM(L35,1)","v":47},{"$f":"S34","v":"2010-11-14"},{"$f":"S34+1","v":"2010-11-15"},"2010-11-16","2010-11-17","2010-11-18","2010-11-19","2010-11-20","2010-11-21",{"$f":"WEEKNUM(M35,2)","v":47},{"$f":"WEEKNUM(V35,1)","v":51},{"$f":"AC34","v":"2010-12-12"},{"$f":"AC34+1","v":"2010-12-13"},"2010-12-14","2010-12-15","2010-12-16","2010-12-17","2010-12-18","2010-12-19",{"$f":"WEEKNUM(W35,2)","v":51}]
[{"$f":"WEEKNUM(B36,1)","v":43},{"$f":"I35","v":"2010-10-17"},{"$f":"I35+1","v":"2010-10-18"},"2010-10-19","2010-10-20","2010-10-21","2010-10-22","2010-10-23","2010-10-24",{"$f":"WEEKNUM(C36,2)","v":43},{"$f":"WEEKNUM(L36,1)","v":48},{"$f":"S35","v":"2010-11-21"},{"$f":"S35+1","v":"2010-11-22"},"2010-11-23","2010-11-24","2010-11-25","2010-11-26","2010-11-27","2010-11-28",{"$f":"WEEKNUM(M36,2)","v":48},{"$f":"WEEKNUM(V36,1)","v":52},{"$f":"AC35","v":"2010-12-19"},{"$f":"AC35+1","v":"2010-12-20"},"2010-12-21","2010-12-22","2010-12-23","2010-12-24","2010-12-25","2010-12-26",{"$f":"WEEKNUM(W36,2)","v":52}]
[{"$f":"IF(B37=\"\",\"\",WEEKNUM(B37,1))","v":44},{"$f":"I36","v":"2010-10-24"},{"$f":"IF(I36<EOMONTH(C31,0),I36+1,\"\")","v":"2010-10-25"},{"$f":"IF(C37<EOMONTH(C31,0),C37+1,\"\")","v":"2010-10-26"},{"$f":"IF(D37<EOMONTH(C31,0),D37+1,\"\")","v":"2010-10-27"},{"$f":"IF(E37<EOMONTH(C31,0),E37+1,\"\")","v":"2010-10-28"},{"$f":"IF(F37<EOMONTH(C31,0),F37+1,\"\")","v":"2010-10-29"},{"$f":"IF(G37<EOMONTH(C31,0),G37+1,\"\")","v":"2010-10-30"},{"$f":"IF(H37<EOMONTH(C31,0),H37+1,\"\")","v":"2010-10-31"},{"$f":"IF(C37=\"\",\"\",WEEKNUM(C37,2))","v":44},{"$f":"IF(L37=\"\",\"\",WEEKNUM(L37,1))","v":49},{"$f":"S36","v":"2010-11-28"},{"$f":"IF(S36<EOMONTH(M31,0),S36+1,\"\")","v":"2010-11-29"},{"$f":"IF(M37<EOMONTH(M31,0),M37+1,\"\")","v":"2010-11-30"},{"$f":"IF(N37<EOMONTH(M31,0),N37+1,\"\")","v":""},{"$f":"IF(O37<EOMONTH(M31,0),O37+1,\"\")","v":""},{"$f":"IF(P37<EOMONTH(M31,0),P37+1,\"\")","v":""},{"$f":"IF(Q37<EOMONTH(M31,0),Q37+1,\"\")","v":""},{"$f":"IF(R37<EOMONTH(M31,0),R37+1,\"\")","v":""},{"$f":"IF(M37=\"\",\"\",WEEKNUM(M37,2))","v":49},{"$f":"IF(V37=\"\",\"\",WEEKNUM(V37,1))","v":53},{"$f":"AC36","v":"2010-12-26"},{"$f":"IF(AC36<EOMONTH(W31,0),AC36+1,\"\")","v":"2010-12-27"},{"$f":"IF(W37<EOMONTH(W31,0),W37+1,\"\")","v":"2010-12-28"},{"$f":"IF(X37<EOMONTH(W31,0),X37+1,\"\")","v":"2010-12-29"},{"$f":"IF(Y37<EOMONTH(W31,0),Y37+1,\"\")","v":"2010-12-30"},{"$f":"IF(Z37<EOMONTH(W31,0),Z37+1,\"\")","v":"2010-12-31"},{"$f":"IF(AA37<EOMONTH(W31,0),AA37+1,\"\")","v":""},{"$f":"IF(AB37<EOMONTH(W31,0),AB37+1,\"\")","v":""},{"$f":"IF(W37=\"\",\"\",WEEKNUM(W37,2))","v":53}]
[{"$f":"IF(B38=\"\",\"\",WEEKNUM(B38,1))","v":45},{"$f":"I37","v":"2010-10-31"},{"$f":"IF(I37<EOMONTH(C31,0),I37+1,\"\")","v":""},{"$f":"IF(C38<EOMONTH(C31,0),C38+1,\"\")","v":""},null,null,null,null,null,{"$f":"IF(C38=\"\",\"\",WEEKNUM(C38,2))","v":""},{"$f":"IF(L38=\"\",\"\",WEEKNUM(L38,1))","v":""},{"$f":"S37","v":""},{"$f":"IF(S37<EOMONTH(M31,0),S37+1,\"\")","v":""},{"$f":"IF(M38<EOMONTH(M31,0),M38+1,\"\")","v":""},null,null,null,null,null,{"$f":"IF(M38=\"\",\"\",WEEKNUM(M38,2))","v":""},{"$f":"IF(V38=\"\",\"\",WEEKNUM(V38,1))","v":""},{"$f":"AC37","v":""},{"$f":"IF(AC37<EOMONTH(W31,0),AC37+1,\"\")","v":""},{"$f":"IF(W38<EOMONTH(W31,0),W38+1,\"\")","v":""},null,null,null,null,null,{"$f":"IF(W38=\"\",\"\",WEEKNUM(W38,2))","v":""}]
[]
[]
[null,1,"Mini",null,null,null,null,1,0,null,"NOTE: 1 = Mark -> Visible / 0 = Unmark -> Invisible"]
[null,{"$f":"B32","v":"2010-01-31"},{"$f":"DATE(2010,2,1)","v":"2010-02-01"},{"$f":"C42+1","v":"2010-02-02"},{"$f":"D42+1","v":"2010-02-03"},{"$f":"E42+1","v":"2010-02-04"},{"$f":"F42+1","v":"2010-02-05"},{"$f":"H32","v":"2010-02-06"},{"$f":"AC32","v":"2010-02-07"}]
[]
[]
[null,1]
[null,0]

{"sheet":"Holidays","index":1,"n_rows":92,"n_cols":6,"rows_kept":92,"cut":false,"hidden":false,"merged":[[56,3,56,4]]}
["COUNTRY",{"$f":"Cal!$M$3","v":2010},"TODAY:  ",{"$f":"TODAY()","v":"2010-04-08"},1,{"$f":"IF(AND(NOT(ISBLANK($D1)),$E1=1,YEAR($D1)=$B$1),$D1,\"\")","v":"2010-04-08"}]
["USA","HOLIDAYS","CELEBRATION DATE","DATE",1,"VISIBLE"]
["Spain","Año Nuevo","Primer día del año",{"$f":"DATE($B$1,1,1)","v":"2010-01-01"},1,{"$f":"IF(AND(NOT(ISBLANK($D3)),$E3=1,$E$2=1,$A3=$A$2),$D3,\"\")","v":""}]
["Spain","Reyes Magos","Día de la Epifanía",{"$f":"DATE($B$1,1,CHOOSE(WEEKDAY(DATE($B$1,1,6)),7,6,6,6,6,6,6))","v":"2010-01-06"},1,""]
["Spain","Reyes Magos","Día de la Epifanía",{"$f":"DATE($B$1,1,CHOOSE(WEEKDAY(DATE($B$1,1,6)),7,6,6,6,6,6,6))","v":"2010-01-06"},1,""]
["Spain","Jueves Santo","Primer día del Triduo Pascual",{"$f":"D7-1","v":"2010-04-01"},1,""]
["Spain","Viernes Santo","Crucifixión de Jesús de Nazaret",{"$f":"D8-1","v":"2010-04-02"},1,""]
["Spain","Sábado Santo","Segundo día del Triduo Pascual",{"$f":"D9-1","v":"2010-04-03"},1,""]
["Spain","Domingo de Pascua - Easter Sunday","Computus: Resurrection Day - Pascua de Resurrección",{"$f":"DATE($B$1,E75,E74)","v":"2010-04-04"},1,""]
["Spain","Día Internacional de los Trabajadores","Primero de Mayo",{"$f":"DATE($B$1,5,1)","v":"2010-05-01"},1,""]
["Spain","Asunción de la Virgen María","15 de agosto",{"$f":"DATE($B$1,8,15)","v":"2010-08-15"},1,""]
["Spain","Fiesta Nacional de España","12 de octubre Día del Pilar y Día de la Hispanidad",{"$f":"DATE($B$1,10,12)","v":"2010-10-12"},1,""]
["Spain","Día de Todos Los Santos","1 de noviembre",{"$f":"DATE($B$1,11,1)","v":"2010-11-01"},1,""]
["Spain","Día de la Constitución Española","6 de diciembre Referéndum de la Constitución española",{"$f":"DATE($B$1,12,6)","v":"2010-12-06"},1,""]
["Spain","Inmaculada Concepción","8 de diciembre",{"$f":"DATE($B$1,12,8)","v":"2010-12-08"},1,""]
["Spain","Día de Navidad","25 de diciembre",{"$f":"DATE($B$1,12,25)","v":"2010-12-25"},1,""]
[null,null,null,null,1,""]
["USA","New Year","First day of the year",{"$f":"DATE($B$1,1,CHOOSE(WEEKDAY(DATE($B$1,1,1)),2,1,1,1,1,1,3))","v":"2010-01-01"},1,"2010-01-01"]
["USA","Martin Luther King Day","The third Monday in January",{"$f":"DATE($B$1,1,CHOOSE(WEEKDAY(DATE($B$1,1,1)),16,15,21,20,19,18,17))","v":"2010-01-18"},1,"2010-01-18"]
["USA","President Day","Third Monday in February",{"$f":"DATE($B$1,2,CHOOSE(WEEKDAY(DATE($B$1,2,15)),16,15,21,20,19,18,17))","v":"2010-02-15"},1,"2010-02-15"]
["USA","Memorial Day","Last Monday in May",{"$f":"DATE($B$1,5,31)-WEEKDAY(DATE($B$1,5,31),3)","v":"2010-05-31"},1,"2010-05-31"]
["USA","Independence Day","The Glorious Fourth of July",{"$f":"DATE($B$1,7,4)","v":"2010-07-04"},1,"2010-07-04"]
["USA","The Fourth of July Federal Holiday","The signing of the Declaration of Independence",{"$f":"DATE($B$1,7,CHOOSE(WEEKDAY(DATE($B$1,7,4)),5,4,4,4,4,4,3))","v":"2010-07-05"},1,"2010-07-05"]
["USA","Labor Day","First Monday in September",{"$f":"DATE($B$1,9,CHOOSE(WEEKDAY(DATE($B$1,9,1)),2,1,7,6,5,4,3))","v":"2010-09-06"},1,"2010-09-06"]
["USA","Columbus Day","Second Monday in October ",{"$f":"DATE($B$1,10,CHOOSE(WEEKDAY(DATE($B$1,10,8)),9,8,14,13,12,11,10))","v":"2010-10-11"},1,"2010-10-11"]
["USA","Veterans Day","November 11 (or nearest weekday)",{"$f":"DATE($B$1,11,CHOOSE(WEEKDAY(DATE($B$1,11,11)),12,11,11,11,11,11,10))","v":"2010-11-11"},1,"2010-11-11"]
["USA","Thanksgiving Day","4th Thursday in November ",{"$f":"DATE($B$1,11,CHOOSE(WEEKDAY(DATE($B$1,11,1)),26,25,24,23,22,28,27))","v":"2010-11-25"},1,"2010-11-25"]
["USA","Christmas Day Holiday","December 25  (or nearest weekday)",{"$f":"DATE($B$1,12,CHOOSE(WEEKDAY(DATE($B$1,12,25)),26,25,25,25,25,25,24))","v":"2010-12-24"},1,"2010-12-24"]
[null,null,null,null,1,""]
["Canada","Thanksgiving Day","2nd Monday in October ",{"$f":"DATE($B$1,10,CHOOSE(WEEKDAY(DATE($B$1,10,1)),9,8,14,13,12,11,10))","v":"2010-10-11"},1,""]
[null,null,null,null,1,""]
["India","Republic Day","Republic Day of India on 26 January, 1950",{"$f":"DATE($B$1,1,26)","v":"2010-01-26"},1,""]
["India","Independence Day","Independence Day of India on 15 August, 1947",{"$f":"DATE($B$1,8,15)","v":"2010-08-15"},1,""]
["India","Gandhi Jayanti","The birthday of Mahatma Gandhi on October 2, 1869",{"$f":"DATE($B$1,10,2)","v":"2010-10-02"},1,""]
[null,null,null,null,1,{"$f":"IF(AND(NOT(ISBLANK($D35)),$E35=1,$E$2=1,$A35=$A$2),$D35,\"\")","v":""}]
[null,null,null,null,1,""]
[null,null,null,null,1,""]
[null,null,null,null,1,""]
[null,null,null,null,1,""]
[null,null,null,null,1,""]
[null,null,null,null,1,""]
[null,null,null,null,1,""]
[null,null,null,null,1,""]
[null,null,null,null,1,""]
[null,null,null,null,1,""]
[null,null,null,null,1,""]
[null,null,null,null,1,""]
[null,null,null,null,1,""]
[null,null,null,null,1,""]
[null,null,null,null,1,""]
[null,null,null,null,1,""]
[null,null,null,null,1,""]
[]
[]
[]
[]
["COUNTRIES",null,null,"Easter Algorithm"]
["China",null,null,"FirstDig",{"$f":"INT($B$1/100)","v":20}]
["India",null,null,"Remain19",{"$f":"MOD($B$1,19)","v":15}]
["USA",null,null,"temp",{"$f":"INT((E58 - 15) / 2) + 202 - 11 * E59","v":39}]
["Indonesia",null,null,"temp",{"$f":"IF(OR(E58=21,E58=24,E58=25,E58=27,E58=28,E58=29,E58=30,E58=31,E58=32,E58=34,E58=35,E58=38),E60-1,E60)","v":39}]
["Brazil",null,null,"temp",{"$f":"IF(OR(E58=33,E58=36,E58=37,E58=39,E58=40),E61-2,E61)","v":39}]
["Pakistan",null,null,"temp",{"$f":"MOD(E62,30)","v":9}]
["Bangladesh",null,null,"tA",{"$f":"E63 + 21","v":30}]
["Nigeria",null,null,"tA",{"$f":"IF(E63=29,E64-1,IF(AND(E63=28,E59>10),E64-1,E64))","v":30}]
["Russia",null,null,"tB",{"$f":"MOD((E65 - 19),7)","v":4}]
["Japan",null,null,"tC",{"$f":"MOD((40 - E58),4)","v":0}]
["Mexico",null,null,"tC",{"$f":"IF(E67=3,E67+1,E67)","v":0}]
["Philippines",null,null,"tC",{"$f":"IF(E68>1,E68+1,E68)","v":0}]
["Vietnam",null,null,"temp",{"$f":"MOD($B$1,100)","v":10}]
["Germany",null,null,"tD",{"$f":"MOD((E70 + INT(E70 / 4)),7)","v":5}]
["Ethiopia",null,null,"tE",{"$f":"MOD((20 - E66 - E69 - E71),7) + 1","v":5}]
["Egypt",null,null,"d",{"$f":"E65 + E72","v":35}]
["Iran",null,null,"d",{"$f":"IF(E73>31,E73-31,E73)","v":4}]
["Turkey",null,null,"m",{"$f":"IF(E73>31,4,3)","v":4}]
["Congo"]
["France"]
["Thailand"]
["UK"]
["Italy"]
["Myanmar"]
["South Korea"]
["South Africa"]
["Spain"]
[]
[]
["Canada"]
[]
[]
[]
[null,null,null,null,1]
[null,null,null,null,0]

{"sheet":"Diary","index":2,"n_rows":62,"n_cols":4,"rows_kept":62,"cut":false,"hidden":false,"merged":[]}
[{"$f":"Cal!$M$3","v":2010},"DIARY",1,"VISIBLE"]
["My birthday (Pedro Wave)",{"$f":"DATE($A$1,7,17)","v":"2010-07-17"},1,{"$f":"IF(AND(NOT(ISBLANK($B2)),$C2=1,$C$1=1),$B2,\"\")","v":"2010-07-17"}]
[null,null,1,{"$f":"IF(AND(NOT(ISBLANK($B3)),$C3=1,$C$1=1),$B3,\"\")","v":""}]
[null,null,1,""]
[null,null,1,""]
[null,null,1,""]
[null,null,1,""]
[null,null,1,""]
[null,null,1,""]
[null,null,1,""]
[null,null,1,""]
[null,null,1,""]
[null,null,1,""]
[null,null,1,""]
[null,null,1,""]
[null,null,1,""]
[null,null,1,""]
[null,null,1,""]
[null,null,1,""]
[null,null,1,""]
[null,null,1,""]
[null,null,1,""]
[null,null,1,""]
[null,null,1,""]
[null,null,1,""]
[null,null,1,""]
[null,null,1,""]
[null,null,1,""]
[null,null,1,""]
[null,null,1,""]
[null,null,1,""]
[null,null,1,""]
[null,null,1,""]
[null,null,1,""]
[null,null,1,""]
[null,null,1,""]
[null,null,1,""]
[null,null,1,""]
[null,null,1,""]
[null,null,1,""]
[null,null,1,""]
[null,null,1,""]
[null,null,1,""]
[null,null,1,""]
[null,null,1,""]
[null,null,1,""]
[null,null,1,""]
[null,null,1,""]
[null,null,1,""]
[null,null,1,""]
[null,null,1,""]
[null,null,1,""]
[]
[]
[]
[]
[]
[]
[]
[]
[null,null,1]
[null,null,0]

{"sheet":"Events","index":3,"n_rows":396,"n_cols":4,"rows_kept":396,"cut":false,"hidden":false,"merged":[]}
[{"$f":"Cal!$M$3","v":2010},"EVENT DATE",1,"VISIBLE"]
["World Leprosy Day",{"$f":"DATE($A$1,1,31)","v":"2010-01-31"},1,{"$f":"IF(AND(NOT(ISBLANK($B2)),$C2=1,$C$1=1),$B2,\"\")","v":"2010-01-31"}]
["World Cancer Day",{"$f":"DATE($A$1,2,4)","v":"2010-02-04"},1,"2010-02-04"]
["World Day of the Sick",{"$f":"DATE($A$1,2,11)","v":"2010-02-11"},1,"2010-02-11"]
["Valentines Day",{"$f":"DATE($A$1,2,14)","v":"2010-02-14"},1,"2010-02-14"]
["International Mother Language Day",{"$f":"DATE($A$1,2,21)","v":"2010-02-21"},1,"2010-02-21"]
["United Nations Day for Women's Rights and International Peace",{"$f":"DATE($A$1,3,8)","v":"2010-03-08"},1,"2010-03-08"]
["World Kidney Day",{"$f":"DATE($A$1,3,11)","v":"2010-03-11"},1,"2010-03-11"]
["World Glaucoma Day",{"$f":"DATE($A$1,3,12)","v":"2010-03-12"},1,"2010-03-12"]
["World Sleep Day",{"$f":"DATE($A$1,3,19)","v":"2010-03-19"},1,"2010-03-19"]
["World Day for Water",{"$f":"DATE($A$1,3,22)","v":"2010-03-22"},1,"2010-03-22"]
["World Meteorological Day",{"$f":"DATE($A$1,3,23)","v":"2010-03-23"},1,"2010-03-23"]
["World Tuberculosis Day",{"$f":"DATE($A$1,3,24)","v":"2010-03-24"},1,"2010-03-24"]
["World Autism Awareness Day",{"$f":"DATE($A$1,4,2)","v":"2010-04-02"},1,"2010-04-02"]
["World Health Day",{"$f":"DATE($A$1,4,7)","v":"2010-04-07"},1,"2010-04-07"]
["World Parkinson’s Day",{"$f":"DATE($A$1,4,11)","v":"2010-04-11"},1,"2010-04-11"]
["World Voice Day",{"$f":"DATE($A$1,4,16)","v":"2010-04-16"},1,"2010-04-16"]
["World Haemophilia Day",{"$f":"DATE($A$1,4,17)","v":"2010-04-17"},1,"2010-04-17"]
["World Book and Copyright Day",{"$f":"DATE($A$1,4,23)","v":"2010-04-23"},1,"2010-04-23"]
["World Intellectual Property Day",{"$f":"DATE($A$1,4,26)","v":"2010-04-26"},1,"2010-04-26"]
["May Day - Labour Day",{"$f":"DATE($A$1,5,1)","v":"2010-05-01"},1,"2010-05-01"]
["World Press Freedom Day",{"$f":"DATE($A$1,5,3)","v":"2010-05-03"},1,"2010-05-03"]
["World Lupus Day",{"$f":"DATE($A$1,5,10)","v":"2010-05-10"},1,"2010-05-10"]
["World Fibromyalgia and Chronic Fatigue Syndrome Day",{"$f":"DATE($A$1,5,12)","v":"2010-05-12"},1,"2010-05-12"]
["World Hypertension Day",{"$f":"DATE($A$1,5,14)","v":"2010-05-14"},1,"2010-05-14"]
["International Day of Families",{"$f":"DATE($A$1,5,15)","v":"2010-05-15"},1,"2010-05-15"]
["World Information Society Day",{"$f":"DATE($A$1,5,17)","v":"2010-05-17"},1,"2010-05-17"]
["World Hepatitis Day",{"$f":"DATE($A$1,5,19)","v":"2010-05-19"},1,"2010-05-19"]
["World No Tobacco Day",{"$f":"DATE($A$1,5,31)","v":"2010-05-31"},1,"2010-05-31"]
["World Environment Day",{"$f":"DATE($A$1,6,5)","v":"2010-06-05"},1,"2010-06-05"]
["World Ocean Day",{"$f":"DATE($A$1,6,8)","v":"2010-06-08"},1,"2010-06-08"]
["World Day Against Child Labour",{"$f":"DATE($A$1,6,12)","v":"2010-06-12"},1,"2010-06-12"]
["World Blood Donor Day",{"$f":"DATE($A$1,6,14)","v":"2010-06-14"},1,"2010-06-14"]
["World Day to Combat Desertification and Drought",{"$f":"DATE($A$1,6,17)","v":"2010-06-17"},1,"2010-06-17"]
["World Refugee Day",{"$f":"DATE($A$1,6,20)","v":"2010-06-20"},1,"2010-06-20"]
["World Music Day",{"$f":"DATE($A$1,6,21)","v":"2010-06-21"},1,"2010-06-21"]
["World Population Day",{"$f":"DATE($A$1,7,11)","v":"2010-07-11"},1,"2010-07-11"]
["International Day of the World's Indigenous People",{"$f":"DATE($A$1,8,9)","v":"2010-08-09"},1,"2010-08-09"]
["World Humanitarian Day",{"$f":"DATE($A$1,8,19)","v":"2010-08-19"},1,"2010-08-19"]
["International Literacy Day",{"$f":"DATE($A$1,9,8)","v":"2010-09-08"},1,"2010-09-08"]
["World First Aid Day",{"$f":"DATE($A$1,9,11)","v":"2010-09-11"},1,"2010-09-11"]
["International Day of Democracy",{"$f":"DATE($A$1,9,15)","v":"2010-09-15"},1,"2010-09-15"]
["International Day for the Preservation of the Ozone Layer",{"$f":"DATE($A$1,9,16)","v":"2010-09-16"},1,"2010-09-16"]
["International Day of Peace",{"$f":"DATE($A$1,9,21)","v":"2010-09-21"},1,"2010-09-21"]
["World Alzheimer's Day",{"$f":"DATE($A$1,9,21)","v":"2010-09-21"},1,"2010-09-21"]
["World Car Free Day",{"$f":"DATE($A$1,9,22)","v":"2010-09-22"},1,{"$f":"IF(AND(NOT(ISBLANK($B46)),$C46=1,$C$1=1),$B46,\"\")","v":"2010-09-22"}]
["World Heart Day",{"$f":"DATE($A$1,9,26)","v":"2010-09-26"},1,"2010-09-26"]
["World Tourism Day",{"$f":"DATE($A$1,9,27)","v":"2010-09-27"},1,"2010-09-27"]
["World Rabies Day",{"$f":"DATE($A$1,9,28)","v":"2010-09-28"},1,"2010-09-28"]
["World Vegetarian Day",{"$f":"DATE($A$1,10,1)","v":"2010-10-01"},1,"2010-10-01"]
["International Day of Non-Violence",{"$f":"DATE($A$1,10,2)","v":"2010-10-02"},1,"2010-10-02"]
["World Teachers' Day",{"$f":"DATE($A$1,10,5)","v":"2010-10-05"},1,"2010-10-05"]
["World Humanitarian Action Day",{"$f":"DATE($A$1,10,8)","v":"2010-10-08"},1,"2010-10-08"]
["World Post Day",{"$f":"DATE($A$1,10,9)","v":"2010-10-09"},1,"2010-10-09"]
["World Mental Health Day",{"$f":"DATE($A$1,10,10)","v":"2010-10-10"},1,"2010-10-10"]
["World Standards Day",{"$f":"DATE($A$1,10,14)","v":"2010-10-14"},1,"2010-10-14"]
["Global Handwashing Day",{"$f":"DATE($A$1,10,15)","v":"2010-10-15"},1,"2010-10-15"]
["World Food Day",{"$f":"DATE($A$1,10,16)","v":"2010-10-16"},1,"2010-10-16"]
["International Day for the Eradication of Poverty",{"$f":"DATE($A$1,10,17)","v":"2010-10-17"},1,"2010-10-17"]
["World Menopause Day",{"$f":"DATE($A$1,10,18)","v":"2010-10-18"},1,{"$f":"IF(AND(NOT(ISBLANK($B60)),$C60=1,$C$1=1),$B60,\"\")","v":"2010-10-18"}]
["World Osteoporosis Day",{"$f":"DATE($A$1,10,20)","v":"2010-10-20"},1,"2010-10-20"]
["United Nations Day",{"$f":"DATE($A$1,10,24)","v":"2010-10-24"},1,"2010-10-24"]
["World Stroke Day",{"$f":"DATE($A$1,10,29)","v":"2010-10-29"},1,"2010-10-29"]
["World Savings Day",{"$f":"DATE($A$1,10,31)","v":"2010-10-31"},1,"2010-10-31"]
["World Freedom Day",{"$f":"DATE($A$1,11,9)","v":"2010-11-09"},1,"2010-11-09"]
["World Diabetes Day",{"$f":"DATE($A$1,11,14)","v":"2010-11-14"},1,"2010-11-14"]
["International Day for Tolerance",{"$f":"DATE($A$1,11,16)","v":"2010-11-16"},1,"2010-11-16"]
["World Toilet Day",{"$f":"DATE($A$1,11,19)","v":"2010-11-19"},1,"2010-11-19"]
["Africa Industrialization Day",{"$f":"DATE($A$1,11,20)","v":"2010-11-20"},1,"2010-11-20"]
["Universal Children's Day",{"$f":"DATE($A$1,11,20)","v":"2010-11-20"},1,"2010-11-20"]
["World Television Day",{"$f":"DATE($A$1,11,21)","v":"2010-11-21"},1,"2010-11-21"]
["International Day for the Elimination of Violence against Women",{"$f":"DATE($A$1,11,25)","v":"2010-11-25"},1,"2010-11-25"]
["International Day of Solidarity with the Palestinian People",{"$f":"DATE($A$1,11,29)","v":"2010-11-29"},1,"2010-11-29"]
["Computer Security Day",{"$f":"DATE($A$1,11,30)","v":"2010-11-30"},1,"2010-11-30"]
["World Aids Day",{"$f":"DATE($A$1,12,1)","v":"2010-12-01"},1,"2010-12-01"]
["International Day for the Abolition of Slavery",{"$f":"DATE($A$1,12,2)","v":"2010-12-02"},1,"2010-12-02"]
["International Day of Persons with Disabilities",{"$f":"DATE($A$1,12,3)","v":"2010-12-03"},1,"2010-12-03"]
["International Volunteer Day for Economic and Social Development",{"$f":"DATE($A$1,12,5)","v":"2010-12-05"},1,"2010-12-05"]
["International Civil Aviation Day",{"$f":"DATE($A$1,12,7)","v":"2010-12-07"},1,"2010-12-07"]
["The International Day against Corruption",{"$f":"DATE($A$1,12,9)","v":"2010-12-09"},1,"2010-12-09"]
["Human Rights Day",{"$f":"DATE($A$1,12,10)","v":"2010-12-10"},1,"2010-12-10"]
["International Migrants Day",{"$f":"DATE($A$1,12,18)","v":"2010-12-18"},1,"2010-12-18"]
[null,null,1,""]
[null,null,1,""]
[null,null,1,""]
[null,null,1,""]
[null,null,1,""]
[null,null,1,""]
[null,null,1,""]
[null,null,1,""]
[null,null,1,""]
[null,null,1,""]
[null,null,1,""]
[null,null,1,""]
[null,null,1,""]
[null,null,1,""]
[null,null,1,""]
[null,null,1,""]
[null,null,1,""]
[null,null,1,""]
[null,null,1,""]
[null,null,1,""]
[null,null,1,""]
[null,null,1,""]
[null,null,1,""]
[null,null,1,""]
[null,null,1,""]
[null,null,1,""]
[null,null,1,""]
[null,null,1,""]
[null,null,1,""]
[null,null,1,""]
[null,null,1,""]
[null,null,1,""]
[null,null,1,""]
[null,null,1,""]
[null,null,1,""]
[null,null,1,""]
[null,null,1,""]
[null,null,1,""]
[null,null,1,""]
[null,null,1,""]
[null,null,1,""]
[null,null,1,{"$f":"IF(AND(NOT(ISBLANK($B124)),$C124=1,$C$1=1),$B124,\"\")","v":""}]
[null,null,1,""]
[null,null,1,""]
[null,null,1,""]
[null,null,1,""]
[null,null,1,""]
[null,null,1,""]
[null,null,1,""]
[null,null,1,""]
[null,null,1,""]
[null,null,1,""]
[null,null,1,""]
[null,null,1,""]
[null,null,1,""]
[null,null,1,""]
[null,null,1,""]
[null,null,1,""]
[null,null,1,""]
[null,null,1,""]
[null,null,1,""]
[null,null,1,""]
[null,null,1,""]
[null,null,1,""]
[null,null,1,""]
[null,null,1,""]
[null,null,1,""]
[null,null,1,""]
[null,null,1,""]
[null,null,null,""]
[null,null,null,""]
[null,null,null,""]
[null,null,null,""]
[null,null,1,""]
[null,null,0,""]
[null,null,null,""]
[null,null,null,""]
[null,null,null,""]
[null,null,null,""]
[null,null,null,""]
[null,null,null,""]
[null,null,null,""]
[null,null,null,""]
[null,null,null,""]
[null,null,null,""]
[null,null,null,""]
[null,null,null,""]
[null,null,null,""]
[null,null,null,""]
[null,null,null,""]
[null,null,null,""]
[null,null,null,""]
[null,null,null,""]
[null,null,null,""]
[null,null,null,""]
[null,null,null,""]
[null,null,null,""]
[null,null,null,""]
[null,null,null,""]
[null,null,null,""]
[null,null,null,""]
[null,null,null,""]
[null,null,null,""]
[null,null,null,""]
[null,null,null,""]
[null,null,null,{"$f":"IF(AND(NOT(ISBLANK($B188)),$C188=1,$C$1=1),$B188,\"\")","v":""}]
[null,null,null,""]
[null,null,null,""]
[null,null,null,""]
[null,null,null,""]
[null,null,null,""]
[null,null,null,""]
[null,null,null,""]
[null,null,null,""]
[null,null,null,""]
[null,null,null,""]
[null,null,null,""]
[null,null,null,""]
[null,null,null,""]
[null,null,null,""]
[null,null,null,""]
[null,null,null,""]
[null,null,null,""]
[null,null,null,""]
[null,null,null,""]
[null,null,null,""]
[null,null,null,""]
[null,null,null,""]
[null,null,null,""]
[null,null,null,""]
[null,null,null,""]
[null,null,null,""]
[null,null,null,""]
[null,null,null,""]
[null,null,null,""]
[null,null,null,""]
[null,null,null,""]
[null,null,null,""]
[null,null,null,""]
[null,null,null,""]
[null,null,null,""]
[null,null,null,""]
[null,null,null,""]
[null,null,null,""]
[null,null,null,""]
[null,null,null,""]
[null,null,null,""]
[null,null,null,""]
[null,null,null,""]
[null,null,null,""]
[null,null,null,""]
[null,null,null,""]
[null,null,null,""]
[null,null,null,""]
[null,null,null,""]
[null,null,null,""]
[null,null,null,""]
[null,null,null,""]
[null,null,null,""]
[null,null,null,""]
[null,null,null,""]
[null,null,null,""]
[null,null,null,""]
[null,null,null,""]
[null,null,null,""]
[null,null,null,""]
[null,null,null,""]
[null,null,null,""]
[null,null,null,""]
[null,null,null,{"$f":"IF(AND(NOT(ISBLANK($B252)),$C252=1,$C$1=1),$B252,\"\")","v":""}]
[null,null,null,""]
[null,null,null,""]
[null,null,null,""]
[null,null,null,""]
[null,null,null,""]
[null,null,null,""]
[null,null,null,""]
[null,null,null,""]
[null,null,null,""]
[null,null,null,""]
[null,null,null,""]
[null,null,null,""]
[null,null,null,""]
[null,null,null,""]
[null,null,null,""]
[null,null,null,""]
[null,null,null,""]
[null,null,null,""]
[null,null,null,""]
[null,null,null,""]
[null,null,null,""]
[null,null,null,""]
[null,null,null,""]
[null,null,null,""]
[null,null,null,""]
[null,null,null,""]
[null,null,null,""]
[null,null,null,""]
[null,null,null,""]
[null,null,null,""]
[null,null,null,""]
[null,null,null,""]
[null,null,null,""]
[null,null,null,""]
[null,null,null,""]
[null,null,null,""]
[null,null,null,""]
[null,null,null,""]
[null,null,null,""]
[null,null,null,""]
[null,null,null,""]
[null,null,null,""]
[null,null,null,""]
[null,null,null,""]
[null,null,null,""]
[null,null,null,""]
[null,null,null,""]
[null,null,null,""]
[null,null,null,""]
[null,null,null,""]
[null,null,null,""]
[null,null,null,""]
[null,null,null,""]
[null,null,null,""]
[null,null,null,""]
[null,null,null,""]
[null,null,null,""]
[null,null,null,""]
[null,null,null,""]
[null,null,null,""]
[null,null,null,""]
[null,null,null,""]
[null,null,null,""]
[null,null,null,{"$f":"IF(AND(NOT(ISBLANK($B316)),$C316=1,$C$1=1),$B316,\"\")","v":""}]
[null,null,null,""]
[null,null,null,""]
[null,null,null,""]
[null,null,null,""]
[null,null,null,""]
[null,null,null,""]
[null,null,null,""]
[null,null,null,""]
[null,null,null,""]
[null,null,null,""]
[null,null,null,""]
[null,null,null,""]
[null,null,null,""]
[null,null,null,""]
[null,null,null,""]
[null,null,null,""]
[null,null,null,""]
[null,null,null,""]
[null,null,null,""]
[null,null,null,""]
[null,null,null,""]
[null,null,null,""]
[null,null,null,""]
[null,null,null,""]
[null,null,null,""]
[null,null,null,""]
[null,null,null,""]
[null,null,null,""]
[null,null,null,""]
[null,null,null,""]
[null,null,null,""]
[null,null,null,""]
[null,null,null,""]
[null,null,null,""]
[null,null,null,""]
[null,null,null,""]
[null,null,null,""]
[null,null,null,""]
[null,null,null,""]
[null,null,null,""]
[null,null,null,""]
[null,null,null,""]
[null,null,null,""]
[null,null,null,""]
[null,null,null,""]
[null,null,null,""]
[null,null,null,""]
[null,null,null,""]
[null,null,null,""]
[null,null,null,""]
[null,null,null,""]
[null,null,null,""]
[null,null,null,""]
[null,null,null,""]
[null,null,null,""]
[null,null,null,""]
[null,null,null,""]
[null,null,null,""]
[null,null,null,""]
[null,null,null,""]
[null,null,null,""]
[null,null,null,""]
[null,null,null,""]
[null,null,null,{"$f":"IF(AND(NOT(ISBLANK($B380)),$C380=1,$C$1=1),$B380,\"\")","v":""}]
[null,null,null,""]
[null,null,null,""]
[null,null,null,""]
[null,null,null,""]
[null,null,null,""]
[null,null,null,""]
[null,null,null,""]
[null,null,null,""]
[null,null,null,""]
[null,null,null,""]
[null,null,null,""]
[null,null,null,""]
[null,null,null,{"$f":"IF(AND(NOT(ISBLANK($B393)),$C393=1,$C$1=1),$B393,\"\")","v":""}]
[null,null,null,""]
[null,null,null,""]
[null,null,null,""]

{"sheet":"Jan","index":4,"n_rows":35,"n_cols":18,"rows_kept":35,"cut":false,"hidden":false,"merged":[[36,7,36,8],[36,9,36,10],[36,11,36,12],[37,7,37,8],[37,9,37,10],[37,11,37,12],[34,7,34,8],[34,9,34,10],[34,11,34,12],[34,13,34,14],[34,15,34,16],[35,7,35,8],[35,9,35,10],[35,11,35,12],[35,13,35,14],[35,15,35,16],[32,9,32,10],[32,11,32,12],[32,13,32,14],[32,15,32,16],[33,7,33,8],[33,9,33,10],[33,11,33,12],[33,13,33,14],[33,15,33,16],[1,15,1,16],[3,7,3,8],[4,7,4,8],[5,7,5,8],[6,7,6,8],[7,7,7,8],[3,1,3,2],[0,9,0,11],[1,9,1,10],[1,11,1,12],[1,13,1,14],[1,1,1,2],[1,3,1,4],[1,5,1,6],[1,7,1,8],[4,1,4,2],[5,1,5,2],[6,1,6,2],[7,1,7,2],[3,3,3,4],[4,3,4,4],[5,3,5,4],[6,3,6,4],[7,3,7,4],[3,5,3,6],[4,5,4,6],[5,5,5,6],[6,5,6,6],[7,5,7,6],[15,15,15,16],[3,11,3,12],[4,11,4,12],[5,11,5,12],[6,11,6,12],[7,11,7,12],[3,9,3,10],[4,9,4,10],[5,9,5,10],[6,9,6,10],[7,9,7,10],[3,15,3,16],[4,15,4,16],[5,15,5,16],[6,15,6,16],[7,15,7,16],[3,13,3,14],[4,13,4,14],[5,13,5,14],[6,13,6,14],[7,13,7,14],[9,3,9,4],[10,3,10,4],[11,3,11,4],[12,3,12,4],[13,3,13,4],[9,1,9,2],[10,1,10,2],[11,1,11,2],[12,1,12,2],[13,1,13,2],[9,7,9,8],[10,7,10,8],[11,7,11,8],[12,7,12,8],[13,7,13,8],[9,5,9,6],[10,5,10,6],[11,5,11,6],[12,5,12,6],[13,5,13,6],[9,11,9,12],[10,11,10,12],[11,11,11,12],[12,11,12,12],[13,11,13,12],[9,9,9,10],[10,9,10,10],[11,9,11,10],[12,9,12,10],[13,9,13,10],[9,15,9,16],[10,15,10,16],[11,15,11,16],[12,15,12,16],[13,15,13,16],[9,13,9,14],[10,13,10,14],[11,13,11,14],[12,13,12,14],[13,13,13,14],[15,3,15,4],[16,3,16,4],[17,3,17,4],[18,3,18,4],[19,3,19,4],[15,1,15,2],[16,1,16,2],[17,1,17,2],[18,1,18,2],[19,1,19,2],[16,7,16,8],[17,7,17,8],[18,7,18,8],[19,7,19,8],[15,5,15,6],[16,5,16,6],[17,5,17,6],[18,5,18,6],[19,5,19,6],[16,15,16,16],[17,15,17,16],[18,15,18,16],[19,15,19,16],[21,1,21,2],[21,5,21,6],[21,9,21,10],[21,13,21,14],[15,13,15,14],[16,13,16,14],[17,13,17,14],[18,13,18,14],[19,13,19,14],[15,11,15,12],[16,11,16,12],[17,11,17,12],[18,11,18,12],[19,11,19,12],[15,9,15,10],[16,9,16,10],[17,9,17,10],[18,9,18,10],[19,9,19,10],[15,7,15,8],[21,7,21,8],[22,7,22,8],[23,7,23,8],[24,7,24,8],[25,7,25,8],[22,1,22,2],[23,1,23,2],[24,1,24,2],[25,1,25,2],[21,3,21,4],[22,3,22,4],[23,3,23,4],[24,3,24,4],[25,3,25,4],[25,15,25,16],[22,9,22,10],[23,9,23,10],[24,9,24,10],[25,9,25,10],[21,11,21,12],[22,11,22,12],[23,11,23,12],[24,11,24,12],[25,11,25,12],[28,1,28,2],[29,1,29,2],[30,1,30,2],[31,1,31,2],[22,13,22,14],[23,13,23,14],[24,13,24,14],[25,13,25,14],[22,5,22,6],[23,5,23,6],[24,5,24,6],[25,5,25,6],[30,7,30,8],[31,7,31,8],[27,5,27,6],[28,5,28,6],[29,5,29,6],[30,5,30,6],[31,5,31,6],[27,3,27,4],[28,3,28,4],[29,3,29,4],[30,3,30,4],[33,1,33,2],[34,1,34,2],[35,1,35,2],[36,1,36,2],[37,1,37,2],[27,15,27,16],[28,15,28,16],[29,15,29,16],[30,15,30,16],[31,15,31,16],[27,13,27,14],[28,13,28,14],[29,13,29,14],[30,13,30,14],[31,13,31,14],[27,11,27,12],[28,11,28,12],[29,11,29,12],[30,11,30,12],[31,11,31,12],[27,9,27,10],[28,9,28,10],[29,9,29,10],[27,1,27,2],[36,13,36,16],[37,13,37,16],[31,9,31,10],[27,7,27,8],[28,7,28,8],[29,7,29,8],[30,9,30,10],[0,3,0,8],[32,7,32,8],[33,5,33,6],[34,5,34,6],[35,5,35,6],[36,5,36,6],[37,5,37,6],[33,3,33,4],[34,3,34,4],[35,3,35,4],[36,3,36,4],[37,3,37,4],[31,3,31,4],[21,15,21,16],[22,15,22,16],[23,15,23,16],[24,15,24,16]]}
[null,null,null,{"$f":"DATE(Cal!M3,1,1)","v":"2010-01-01"},null,null,null,null,null,{"$f":"Cal!$M$3","v":2010}]
[null,{"$f":"DATE(2010,2,7)","v":"2010-02-07"},null,{"$f":"DATE(2010,2,1)","v":"2010-02-01"},null,{"$f":"DATE(2010,2,2)","v":"2010-02-02"},null,{"$f":"DATE(2010,2,3)","v":"2010-02-03"},null,{"$f":"DATE(2010,2,4)","v":"2010-02-04"},null,{"$f":"DATE(2010,2,5)","v":"2010-02-05"},null,{"$f":"DATE(2010,2,6)","v":"2010-02-06"},null,{"$f":"DATE(2010,2,7)","v":"2010-02-07"}]
[{"$f":"IF(N3=\"\",\"\",WEEKNUM(N3,1))","v":1},null,{"$f":"IF(ISNUMBER(B3),IFERROR(INDIRECT(CONCATENATE(Fiesta,2+MATCH(B3,Fiestas,0))),\"\"),\"\")","v":""},{"$f":"IF(WEEKDAY($D$1)=2,$D$1,\"\")","v":""},{"$f":"IF(ISNUMBER(D3),IFERROR(INDIRECT(CONCATENATE(Fiesta,2+MATCH(D3,Fiestas,0))),\"\"),\"\")","v":""},{"$f":"IF(D3<>\"\",D3+1,IF(WEEKDAY($D$1)=3,$D$1,\"\"))","v":""},{"$f":"IF(ISNUMBER(F3),IFERROR(INDIRECT(CONCATENATE(Fiesta,2+MATCH(F3,Fiestas,0))),\"\"),\"\")","v":""},{"$f":"IF(F3<>\"\",F3+1,IF(WEEKDAY($D$1)=4,$D$1,\"\"))","v":""},{"$f":"IF(ISNUMBER(H3),IFERROR(INDIRECT(CONCATENATE(Fiesta,2+MATCH(H3,Fiestas,0))),\"\"),\"\")","v":""},{"$f":"IF(H3<>\"\",H3+1,IF(WEEKDAY($D$1)=5,$D$1,\"\"))","v":""},{"$f":"IF(ISNUMBER(J3),IFERROR(INDIRECT(CONCATENATE(Fiesta,2+MATCH(J3,Fiestas,0))),\"\"),\"\")","v":""},{"$f":"IF(J3<>\"\",J3+1,IF(WEEKDAY($D$1)=6,$D$1,\"\"))","v":"2010-01-01"},{"$f":"IF(ISNUMBER(L3),IFERROR(INDIRECT(CONCATENATE(Fiesta,2+MATCH(L3,Fiestas,0))),\"\"),\"\")","v":"New Year"},{"$f":"IF(L3<>\"\",L3+1,IF(WEEKDAY($D$1)=7,$D$1,\"\"))","v":"2010-01-02"},{"$f":"IF(ISNUMBER(N3),IFERROR(INDIRECT(CONCATENATE(Fiesta,2+MATCH(N3,Fiestas,0))),\"\"),\"\")","v":""},{"$f":"IF(N3<>\"\",N3+1,IF(WEEKDAY($D$1)=1,$D$1,\"\"))","v":"2010-01-03"},{"$f":"IF(ISNUMBER(P3),IFERROR(INDIRECT(CONCATENATE(Fiesta,2+MATCH(P3,Fiestas,0))),\"\"),\"\")","v":""},{"$f":"IF(P3=\"\",\"\",WEEKNUM(P3,2))","v":1}]
[null,{"$f":"IF(ISNUMBER(B3),IFERROR(INDIRECT(CONCATENATE(Evento,1+MATCH(B3,Eventos,0))),\"\"),\"\")","v":""},null,{"$f":"IF(ISNUMBER(D3),IFERROR(INDIRECT(CONCATENATE(Evento,1+MATCH(D3,Eventos,0))),\"\"),\"\")","v":""},null,{"$f":"IF(ISNUMBER(F3),IFERROR(INDIRECT(CONCATENATE(Evento,1+MATCH(F3,Eventos,0))),\"\"),\"\")","v":""},null,{"$f":"IF(ISNUMBER(H3),IFERROR(INDIRECT(CONCATENATE(Evento,1+MATCH(H3,Eventos,0))),\"\"),\"\")","v":""},null,{"$f":"IF(ISNUMBER(J3),IFERROR(INDIRECT(CONCATENATE(Evento,1+MATCH(J3,Eventos,0))),\"\"),\"\")","v":""},null,{"$f":"IF(ISNUMBER(L3),IFERROR(INDIRECT(CONCATENATE(Evento,1+MATCH(L3,Eventos,0))),\"\"),\"\")","v":""},null,{"$f":"IF(ISNUMBER(N3),IFERROR(INDIRECT(CONCATENATE(Evento,1+MATCH(N3,Eventos,0))),\"\"),\"\")","v":""},null,{"$f":"IF(ISNUMBER(P3),IFERROR(INDIRECT(CONCATENATE(Evento,1+MATCH(P3,Eventos,0))),\"\"),\"\")","v":""}]
[null,{"$f":"IF(ISNUMBER(B3),IFERROR(INDIRECT(CONCATENATE(Agenda,1+MATCH(B3,Agendas,0))),\"\"),\"\")","v":""},null,{"$f":"IF(ISNUMBER(D3),IFERROR(INDIRECT(CONCATENATE(Agenda,1+MATCH(D3,Agendas,0))),\"\"),\"\")","v":""},null,{"$f":"IF(ISNUMBER(F3),IFERROR(INDIRECT(CONCATENATE(Agenda,1+MATCH(F3,Agendas,0))),\"\"),\"\")","v":""},null,{"$f":"IF(ISNUMBER(H3),IFERROR(INDIRECT(CONCATENATE(Agenda,1+MATCH(H3,Agendas,0))),\"\"),\"\")","v":""},null,{"$f":"IF(ISNUMBER(J3),IFERROR(INDIRECT(CONCATENATE(Agenda,1+MATCH(J3,Agendas,0))),\"\"),\"\")","v":""},null,{"$f":"IF(ISNUMBER(L3),IFERROR(INDIRECT(CONCATENATE(Agenda,1+MATCH(L3,Agendas,0))),\"\"),\"\")","v":""},null,{"$f":"IF(ISNUMBER(N3),IFERROR(INDIRECT(CONCATENATE(Agenda,1+MATCH(N3,Agendas,0))),\"\"),\"\")","v":""},null,{"$f":"IF(ISNUMBER(P3),IFERROR(INDIRECT(CONCATENATE(Agenda,1+MATCH(P3,Agendas,0))),\"\"),\"\")","v":""}]
[]
[]
[]
[{"$f":"WEEKNUM(B9,1)","v":2},{"$f":"P3","v":"2010-01-03"},{"$f":"IF(ISNUMBER(B9),IFERROR(INDIRECT(CONCATENATE(Fiesta,2+MATCH(B9,Fiestas,0))),\"\"),\"\")","v":""},{"$f":"P3+1","v":"2010-01-04"},{"$f":"IF(ISNUMBER(D9),IFERROR(INDIRECT(CONCATENATE(Fiesta,2+MATCH(D9,Fiestas,0))),\"\"),\"\")","v":""},{"$f":"D9+1","v":"2010-01-05"},{"$f":"IF(ISNUMBER(F9),IFERROR(INDIRECT(CONCATENATE(Fiesta,2+MATCH(F9,Fiestas,0))),\"\"),\"\")","v":""},{"$f":"F9+1","v":"2010-01-06"},{"$f":"IF(ISNUMBER(H9),IFERROR(INDIRECT(CONCATENATE(Fiesta,2+MATCH(H9,Fiestas,0))),\"\"),\"\")","v":""},{"$f":"H9+1","v":"2010-01-07"},{"$f":"IF(ISNUMBER(J9),IFERROR(INDIRECT(CONCATENATE(Fiesta,2+MATCH(J9,Fiestas,0))),\"\"),\"\")","v":""},{"$f":"J9+1","v":"2010-01-08"},{"$f":"IF(ISNUMBER(L9),IFERROR(INDIRECT(CONCATENATE(Fiesta,2+MATCH(L9,Fiestas,0))),\"\"),\"\")","v":""},{"$f":"L9+1","v":"2010-01-09"},{"$f":"IF(ISNUMBER(N9),IFERROR(INDIRECT(CONCATENATE(Fiesta,2+MATCH(N9,Fiestas,0))),\"\"),\"\")","v":""},{"$f":"N9+1","v":"2010-01-10"},{"$f":"IF(ISNUMBER(P9),IFERROR(INDIRECT(CONCATENATE(Fiesta,2+MATCH(P9,Fiestas,0))),\"\"),\"\")","v":""},{"$f":"WEEKNUM(D9,2)","v":2}]
[null,{"$f":"IF(ISNUMBER(B9),IFERROR(INDIRECT(CONCATENATE(Evento,1+MATCH(B9,Eventos,0))),\"\"),\"\")","v":""},null,{"$f":"IF(ISNUMBER(D9),IFERROR(INDIRECT(CONCATENATE(Evento,1+MATCH(D9,Eventos,0))),\"\"),\"\")","v":""},null,{"$f":"IF(ISNUMBER(F9),IFERROR(INDIRECT(CONCATENATE(Evento,1+MATCH(F9,Eventos,0))),\"\"),\"\")","v":""},null,{"$f":"IF(ISNUMBER(H9),IFERROR(INDIRECT(CONCATENATE(Evento,1+MATCH(H9,Eventos,0))),\"\"),\"\")","v":""},null,{"$f":"IF(ISNUMBER(J9),IFERROR(INDIRECT(CONCATENATE(Evento,1+MATCH(J9,Eventos,0))),\"\"),\"\")","v":""},null,{"$f":"IF(ISNUMBER(L9),IFERROR(INDIRECT(CONCATENATE(Evento,1+MATCH(L9,Eventos,0))),\"\"),\"\")","v":""},null,{"$f":"IF(ISNUMBER(N9),IFERROR(INDIRECT(CONCATENATE(Evento,1+MATCH(N9,Eventos,0))),\"\"),\"\")","v":""},null,{"$f":"IF(ISNUMBER(P9),IFERROR(INDIRECT(CONCATENATE(Evento,1+MATCH(P9,Eventos,0))),\"\"),\"\")","v":""}]
[null,{"$f":"IF(ISNUMBER(B9),IFERROR(INDIRECT(CONCATENATE(Agenda,1+MATCH(B9,Agendas,0))),\"\"),\"\")","v":""},null,{"$f":"IF(ISNUMBER(D9),IFERROR(INDIRECT(CONCATENATE(Agenda,1+MATCH(D9,Agendas,0))),\"\"),\"\")","v":""},null,{"$f":"IF(ISNUMBER(F9),IFERROR(INDIRECT(CONCATENATE(Agenda,1+MATCH(F9,Agendas,0))),\"\"),\"\")","v":""},null,{"$f":"IF(ISNUMBER(H9),IFERROR(INDIRECT(CONCATENATE(Agenda,1+MATCH(H9,Agendas,0))),\"\"),\"\")","v":""},null,{"$f":"IF(ISNUMBER(J9),IFERROR(INDIRECT(CONCATENATE(Agenda,1+MATCH(J9,Agendas,0))),\"\"),\"\")","v":""},null,{"$f":"IF(ISNUMBER(L9),IFERROR(INDIRECT(CONCATENATE(Agenda,1+MATCH(L9,Agendas,0))),\"\"),\"\")","v":""},null,{"$f":"IF(ISNUMBER(N9),IFERROR(INDIRECT(CONCATENATE(Agenda,1+MATCH(N9,Agendas,0))),\"\"),\"\")","v":""},null,{"$f":"IF(ISNUMBER(P9),IFERROR(INDIRECT(CONCATENATE(Agenda,1+MATCH(P9,Agendas,0))),\"\"),\"\")","v":""}]
[]
[]
[]
[{"$f":"WEEKNUM(B15,1)","v":3},{"$f":"P9","v":"2010-01-10"},{"$f":"IF(ISNUMBER(B15),IFERROR(INDIRECT(CONCATENATE(Fiesta,2+MATCH(B15,Fiestas,0))),\"\"),\"\")","v":""},{"$f":"P9+1","v":"2010-01-11"},{"$f":"IF(ISNUMBER(D15),IFERROR(INDIRECT(CONCATENATE(Fiesta,2+MATCH(D15,Fiestas,0))),\"\"),\"\")","v":""},{"$f":"D15+1","v":"2010-01-12"},{"$f":"IF(ISNUMBER(F15),IFERROR(INDIRECT(CONCATENATE(Fiesta,2+MATCH(F15,Fiestas,0))),\"\"),\"\")","v":""},{"$f":"F15+1","v":"2010-01-13"},{"$f":"IF(ISNUMBER(H15),IFERROR(INDIRECT(CONCATENATE(Fiesta,2+MATCH(H15,Fiestas,0))),\"\"),\"\")","v":""},{"$f":"H15+1","v":"2010-01-14"},{"$f":"IF(ISNUMBER(J15),IFERROR(INDIRECT(CONCATENATE(Fiesta,2+MATCH(J15,Fiestas,0))),\"\"),\"\")","v":""},{"$f":"J15+1","v":"2010-01-15"},{"$f":"IF(ISNUMBER(L15),IFERROR(INDIRECT(CONCATENATE(Fiesta,2+MATCH(L15,Fiestas,0))),\"\"),\"\")","v":""},{"$f":"L15+1","v":"2010-01-16"},{"$f":"IF(ISNUMBER(N15),IFERROR(INDIRECT(CONCATENATE(Fiesta,2+MATCH(N15,Fiestas,0))),\"\"),\"\")","v":""},{"$f":"N15+1","v":"2010-01-17"},{"$f":"IF(ISNUMBER(P15),IFERROR(INDIRECT(CONCATENATE(Fiesta,2+MATCH(P15,Fiestas,0))),\"\"),\"\")","v":""},{"$f":"WEEKNUM(D15,2)","v":3}]
[null,{"$f":"IF(ISNUMBER(B15),IFERROR(INDIRECT(CONCATENATE(Evento,1+MATCH(B15,Eventos,0))),\"\"),\"\")","v":""},null,{"$f":"IF(ISNUMBER(D15),IFERROR(INDIRECT(CONCATENATE(Evento,1+MATCH(D15,Eventos,0))),\"\"),\"\")","v":""},null,{"$f":"IF(ISNUMBER(F15),IFERROR(INDIRECT(CONCATENATE(Evento,1+MATCH(F15,Eventos,0))),\"\"),\"\")","v":""},null,{"$f":"IF(ISNUMBER(H15),IFERROR(INDIRECT(CONCATENATE(Evento,1+MATCH(H15,Eventos,0))),\"\"),\"\")","v":""},null,{"$f":"IF(ISNUMBER(J15),IFERROR(INDIRECT(CONCATENATE(Evento,1+MATCH(J15,Eventos,0))),\"\"),\"\")","v":""},null,{"$f":"IF(ISNUMBER(L15),IFERROR(INDIRECT(CONCATENATE(Evento,1+MATCH(L15,Eventos,0))),\"\"),\"\")","v":""},null,{"$f":"IF(ISNUMBER(N15),IFERROR(INDIRECT(CONCATENATE(Evento,1+MATCH(N15,Eventos,0))),\"\"),\"\")","v":""},null,{"$f":"IF(ISNUMBER(P15),IFERROR(INDIRECT(CONCATENATE(Evento,1+MATCH(P15,Eventos,0))),\"\"),\"\")","v":""}]
[null,{"$f":"IF(ISNUMBER(B15),IFERROR(INDIRECT(CONCATENATE(Agenda,1+MATCH(B15,Agendas,0))),\"\"),\"\")","v":""},null,{"$f":"IF(ISNUMBER(D15),IFERROR(INDIRECT(CONCATENATE(Agenda,1+MATCH(D15,Agendas,0))),\"\"),\"\")","v":""},null,{"$f":"IF(ISNUMBER(F15),IFERROR(INDIRECT(CONCATENATE(Agenda,1+MATCH(F15,Agendas,0))),\"\"),\"\")","v":""},null,{"$f":"IF(ISNUMBER(H15),IFERROR(INDIRECT(CONCATENATE(Agenda,1+MATCH(H15,Agendas,0))),\"\"),\"\")","v":""},null,{"$f":"IF(ISNUMBER(J15),IFERROR(INDIRECT(CONCATENATE(Agenda,1+MATCH(J15,Agendas,0))),\"\"),\"\")","v":""},null,{"$f":"IF(ISNUMBER(L15),IFERROR(INDIRECT(CONCATENATE(Agenda,1+MATCH(L15,Agendas,0))),\"\"),\"\")","v":""},null,{"$f":"IF(ISNUMBER(N15),IFERROR(INDIRECT(CONCATENATE(Agenda,1+MATCH(N15,Agendas,0))),\"\"),\"\")","v":""},null,{"$f":"IF(ISNUMBER(P15),IFERROR(INDIRECT(CONCATENATE(Agenda,1+MATCH(P15,Agendas,0))),\"\"),\"\")","v":""}]
[]
[]
[]
[{"$f":"WEEKNUM(B21,1)","v":4},{"$f":"P15","v":"2010-01-17"},{"$f":"IF(ISNUMBER(B21),IFERROR(INDIRECT(CONCATENATE(Fiesta,2+MATCH(B21,Fiestas,0))),\"\"),\"\")","v":""},{"$f":"P15+1","v":"2010-01-18"},{"$f":"IF(ISNUMBER(D21),IFERROR(INDIRECT(CONCATENATE(Fiesta,2+MATCH(D21,Fiestas,0))),\"\"),\"\")","v":"Martin Luther King Day"},{"$f":"D21+1","v":"2010-01-19"},{"$f":"IF(ISNUMBER(F21),IFERROR(INDIRECT(CONCATENATE(Fiesta,2+MATCH(F21,Fiestas,0))),\"\"),\"\")","v":""},{"$f":"F21+1","v":"2010-01-20"},{"$f":"IF(ISNUMBER(H21),IFERROR(INDIRECT(CONCATENATE(Fiesta,2+MATCH(H21,Fiestas,0))),\"\"),\"\")","v":""},{"$f":"H21+1","v":"2010-01-21"},{"$f":"IF(ISNUMBER(J21),IFERROR(INDIRECT(CONCATENATE(Fiesta,2+MATCH(J21,Fiestas,0))),\"\"),\"\")","v":""},{"$f":"J21+1","v":"2010-01-22"},{"$f":"IF(ISNUMBER(L21),IFERROR(INDIRECT(CONCATENATE(Fiesta,2+MATCH(L21,Fiestas,0))),\"\"),\"\")","v":""},{"$f":"L21+1","v":"2010-01-23"},{"$f":"IF(ISNUMBER(N21),IFERROR(INDIRECT(CONCATENATE(Fiesta,2+MATCH(N21,Fiestas,0))),\"\"),\"\")","v":""},{"$f":"N21+1","v":"2010-01-24"},{"$f":"IF(ISNUMBER(P21),IFERROR(INDIRECT(CONCATENATE(Fiesta,2+MATCH(P21,Fiestas,0))),\"\"),\"\")","v":""},{"$f":"WEEKNUM(D21,2)","v":4}]
[null,{"$f":"IF(ISNUMBER(B21),IFERROR(INDIRECT(CONCATENATE(Evento,1+MATCH(B21,Eventos,0))),\"\"),\"\")","v":""},null,{"$f":"IF(ISNUMBER(D21),IFERROR(INDIRECT(CONCATENATE(Evento,1+MATCH(D21,Eventos,0))),\"\"),\"\")","v":""},null,{"$f":"IF(ISNUMBER(F21),IFERROR(INDIRECT(CONCATENATE(Evento,1+MATCH(F21,Eventos,0))),\"\"),\"\")","v":""},null,{"$f":"IF(ISNUMBER(H21),IFERROR(INDIRECT(CONCATENATE(Evento,1+MATCH(H21,Eventos,0))),\"\"),\"\")","v":""},null,{"$f":"IF(ISNUMBER(J21),IFERROR(INDIRECT(CONCATENATE(Evento,1+MATCH(J21,Eventos,0))),\"\"),\"\")","v":""},null,{"$f":"IF(ISNUMBER(L21),IFERROR(INDIRECT(CONCATENATE(Evento,1+MATCH(L21,Eventos,0))),\"\"),\"\")","v":""},null,{"$f":"IF(ISNUMBER(N21),IFERROR(INDIRECT(CONCATENATE(Evento,1+MATCH(N21,Eventos,0))),\"\"),\"\")","v":""},null,{"$f":"IF(ISNUMBER(P21),IFERROR(INDIRECT(CONCATENATE(Evento,1+MATCH(P21,Eventos,0))),\"\"),\"\")","v":""}]
[null,{"$f":"IF(ISNUMBER(B21),IFERROR(INDIRECT(CONCATENATE(Agenda,1+MATCH(B21,Agendas,0))),\"\"),\"\")","v":""},null,{"$f":"IF(ISNUMBER(D21),IFERROR(INDIRECT(CONCATENATE(Agenda,1+MATCH(D21,Agendas,0))),\"\"),\"\")","v":""},null,{"$f":"IF(ISNUMBER(F21),IFERROR(INDIRECT(CONCATENATE(Agenda,1+MATCH(F21,Agendas,0))),\"\"),\"\")","v":""},null,{"$f":"IF(ISNUMBER(H21),IFERROR(INDIRECT(CONCATENATE(Agenda,1+MATCH(H21,Agendas,0))),\"\"),\"\")","v":""},null,{"$f":"IF(ISNUMBER(J21),IFERROR(INDIRECT(CONCATENATE(Agenda,1+MATCH(J21,Agendas,0))),\"\"),\"\")","v":""},null,{"$f":"IF(ISNUMBER(L21),IFERROR(INDIRECT(CONCATENATE(Agenda,1+MATCH(L21,Agendas,0))),\"\"),\"\")","v":""},null,{"$f":"IF(ISNUMBER(N21),IFERROR(INDIRECT(CONCATENATE(Agenda,1+MATCH(N21,Agendas,0))),\"\"),\"\")","v":""},null,{"$f":"IF(ISNUMBER(P21),IFERROR(INDIRECT(CONCATENATE(Agenda,1+MATCH(P21,Agendas,0))),\"\"),\"\")","v":""}]
[]
[]
[]
[{"$f":"IF(B27=\"\",\"\",WEEKNUM(B27,1))","v":5},{"$f":"P21","v":"2010-01-24"},{"$f":"IF(ISNUMBER(B27),IFERROR(INDIRECT(CONCATENATE(Fiesta,2+MATCH(B27,Fiestas,0))),\"\"),\"\")","v":""},{"$f":"IF(P21<EOMONTH($D$1,0),P21+1,\"\")","v":"2010-01-25"},{"$f":"IF(ISNUMBER(D27),IFERROR(INDIRECT(CONCATENATE(Fiesta,2+MATCH(D27,Fiestas,0))),\"\"),\"\")","v":""},{"$f":"IF(D27<EOMONTH($D$1,0),D27+1,\"\")","v":"2010-01-26"},{"$f":"IF(ISNUMBER(F27),IFERROR(INDIRECT(CONCATENATE(Fiesta,2+MATCH(F27,Fiestas,0))),\"\"),\"\")","v":""},{"$f":"IF(F27<EOMONTH($D$1,0),F27+1,\"\")","v":"2010-01-27"},{"$f":"IF(ISNUMBER(H27),IFERROR(INDIRECT(CONCATENATE(Fiesta,2+MATCH(H27,Fiestas,0))),\"\"),\"\")","v":""},{"$f":"IF(H27<EOMONTH($D$1,0),H27+1,\"\")","v":"2010-01-28"},{"$f":"IF(ISNUMBER(J27),IFERROR(INDIRECT(CONCATENATE(Fiesta,2+MATCH(J27,Fiestas,0))),\"\"),\"\")","v":""},{"$f":"IF(J27<EOMONTH($D$1,0),J27+1,\"\")","v":"2010-01-29"},{"$f":"IF(ISNUMBER(L27),IFERROR(INDIRECT(CONCATENATE(Fiesta,2+MATCH(L27,Fiestas,0))),\"\"),\"\")","v":""},{"$f":"IF(L27<EOMONTH($D$1,0),L27+1,\"\")","v":"2010-01-30"},{"$f":"IF(ISNUMBER(N27),IFERROR(INDIRECT(CONCATENATE(Fiesta,2+MATCH(N27,Fiestas,0))),\"\"),\"\")","v":""},{"$f":"IF(N27<EOMONTH($D$1,0),N27+1,\"\")","v":"2010-01-31"},{"$f":"IF(ISNUMBER(P27),IFERROR(INDIRECT(CONCATENATE(Fiesta,2+MATCH(P27,Fiestas,0))),\"\"),\"\")","v":""},{"$f":"IF(D27=\"\",\"\",WEEKNUM(D27,2))","v":5}]
[null,{"$f":"IF(ISNUMBER(B27),IFERROR(INDIRECT(CONCATENATE(Evento,1+MATCH(B27,Eventos,0))),\"\"),\"\")","v":""},null,{"$f":"IF(ISNUMBER(D27),IFERROR(INDIRECT(CONCATENATE(Evento,1+MATCH(D27,Eventos,0))),\"\"),\"\")","v":""},null,{"$f":"IF(ISNUMBER(F27),IFERROR(INDIRECT(CONCATENATE(Evento,1+MATCH(F27,Eventos,0))),\"\"),\"\")","v":""},null,{"$f":"IF(ISNUMBER(H27),IFERROR(INDIRECT(CONCATENATE(Evento,1+MATCH(H27,Eventos,0))),\"\"),\"\")","v":""},null,{"$f":"IF(ISNUMBER(J27),IFERROR(INDIRECT(CONCATENATE(Evento,1+MATCH(J27,Eventos,0))),\"\"),\"\")","v":""},null,{"$f":"IF(ISNUMBER(L27),IFERROR(INDIRECT(CONCATENATE(Evento,1+MATCH(L27,Eventos,0))),\"\"),\"\")","v":""},null,{"$f":"IF(ISNUMBER(N27),IFERROR(INDIRECT(CONCATENATE(Evento,1+MATCH(N27,Eventos,0))),\"\"),\"\")","v":""},null,{"$f":"IF(ISNUMBER(P27),IFERROR(INDIRECT(CONCATENATE(Evento,1+MATCH(P27,Eventos,0))),\"\"),\"\")","v":"World Leprosy Day"}]
[null,{"$f":"IF(ISNUMBER(B27),IFERROR(INDIRECT(CONCATENATE(Agenda,1+MATCH(B27,Agendas,0))),\"\"),\"\")","v":""},null,{"$f":"IF(ISNUMBER(D27),IFERROR(INDIRECT(CONCATENATE(Agenda,1+MATCH(D27,Agendas,0))),\"\"),\"\")","v":""},null,{"$f":"IF(ISNUMBER(F27),IFERROR(INDIRECT(CONCATENATE(Agenda,1+MATCH(F27,Agendas,0))),\"\"),\"\")","v":""},null,{"$f":"IF(ISNUMBER(H27),IFERROR(INDIRECT(CONCATENATE(Agenda,1+MATCH(H27,Agendas,0))),\"\"),\"\")","v":""},null,{"$f":"IF(ISNUMBER(J27),IFERROR(INDIRECT(CONCATENATE(Agenda,1+MATCH(J27,Agendas,0))),\"\"),\"\")","v":""},null,{"$f":"IF(ISNUMBER(L27),IFERROR(INDIRECT(CONCATENATE(Agenda,1+MATCH(L27,Agendas,0))),\"\"),\"\")","v":""},null,{"$f":"IF(ISNUMBER(N27),IFERROR(INDIRECT(CONCATENATE(Agenda,1+MATCH(N27,Agendas,0))),\"\"),\"\")","v":""},null,{"$f":"IF(ISNUMBER(P27),IFERROR(INDIRECT(CONCATENATE(Agenda,1+MATCH(P27,Agendas,0))),\"\"),\"\")","v":""}]
[]
[]
[]
[{"$f":"IF(B33=\"\",\"\",WEEKNUM(B33,1))","v":6},{"$f":"P27","v":"2010-01-31"},{"$f":"IF(ISNUMBER(B33),IFERROR(INDIRECT(CONCATENATE(Fiesta,2+MATCH(B33,Fiestas,0))),\"\"),\"\")","v":""},{"$f":"IF(P27<EOMONTH($D$1,0),P27+1,\"\")","v":""},{"$f":"IF(ISNUMBER(D33),IFERROR(INDIRECT(CONCATENATE(Fiesta,2+MATCH(D33,Fiestas,0))),\"\"),\"\")","v":""},{"$f":"IF(D33<EOMONTH($D$1,0),D33+1,\"\")","v":""},{"$f":"IF(ISNUMBER(F33),IFERROR(INDIRECT(CONCATENATE(Fiesta,2+MATCH(F33,Fiestas,0))),\"\"),\"\")","v":""},"Notes:",null,null,null,null,null,null,null,null,null,{"$f":"IF(D33=\"\",\"\",WEEKNUM(D33,2))","v":""}]
[null,{"$f":"IF(ISNUMBER(B33),IFERROR(INDIRECT(CONCATENATE(Evento,1+MATCH(B33,Eventos,0))),\"\"),\"\")","v":"World Leprosy Day"},null,{"$f":"IF(ISNUMBER(D33),IFERROR(INDIRECT(CONCATENATE(Evento,1+MATCH(D33,Eventos,0))),\"\"),\"\")","v":""},null,{"$f":"IF(ISNUMBER(F33),IFERROR(INDIRECT(CONCATENATE(Evento,1+MATCH(F33,Eventos,0))),\"\"),\"\")","v":""}]
[null,{"$f":"IF(ISNUMBER(B33),IFERROR(INDIRECT(CONCATENATE(Agenda,1+MATCH(B33,Agendas,0))),\"\"),\"\")","v":""},null,{"$f":"IF(ISNUMBER(D33),IFERROR(INDIRECT(CONCATENATE(Agenda,1+MATCH(D33,Agendas,0))),\"\"),\"\")","v":""},null,{"$f":"IF(ISNUMBER(F33),IFERROR(INDIRECT(CONCATENATE(Agenda,1+MATCH(F33,Agendas,0))),\"\"),\"\")","v":""}]

{"sheet":"Feb","index":5,"n_rows":35,"n_cols":18,"rows_kept":35,"cut":false,"hidden":false,"merged":[[36,7,36,8],[36,9,36,10],[36,11,36,12],[37,7,37,8],[37,9,37,10],[37,11,37,12],[36,13,36,16],[37,13,37,16],[34,7,34,8],[34,9,34,10],[34,11,34,12],[34,13,34,14],[34,15,34,16],[35,7,35,8],[35,9,35,10],[35,11,35,12],[35,13,35,14],[35,15,35,16],[37,1,37,2],[37,3,37,4],[37,5,37,6],[36,1,36,2],[36,3,36,4],[36,5,36,6],[35,1,35,2],[35,3,35,4],[35,5,35,6],[34,1,34,2],[34,3,34,4],[34,5,34,6],[31,11,31,12],[31,13,31,14],[31,15,31,16],[33,1,33,2],[33,3,33,4],[33,5,33,6],[31,1,31,2],[31,3,31,4],[31,5,31,6],[31,7,31,8],[31,9,31,10],[32,7,32,8],[32,9,32,10],[32,11,32,12],[32,13,32,14],[32,15,32,16],[33,7,33,8],[33,9,33,10],[33,11,33,12],[33,13,33,14],[33,15,33,16],[29,11,29,12],[29,13,29,14],[29,15,29,16],[30,1,30,2],[30,3,30,4],[30,5,30,6],[30,7,30,8],[30,9,30,10],[30,11,30,12],[30,13,30,14],[30,15,30,16],[29,1,29,2],[29,3,29,4],[29,5,29,6],[29,7,29,8],[29,9,29,10],[27,11,27,12],[27,13,27,14],[27,15,27,16],[28,1,28,2],[28,3,28,4],[28,5,28,6],[28,7,28,8],[28,9,28,10],[28,11,28,12],[28,13,28,14],[28,15,28,16],[27,1,27,2],[27,3,27,4],[27,5,27,6],[27,7,27,8],[27,9,27,10],[24,11,24,12],[24,13,24,14],[24,15,24,16],[25,1,25,2],[25,3,25,4],[25,5,25,6],[25,7,25,8],[25,9,25,10],[25,11,25,12],[25,13,25,14],[25,15,25,16],[24,1,24,2],[24,3,24,4],[24,5,24,6],[24,7,24,8],[24,9,24,10],[22,11,22,12],[22,13,22,14],[22,15,22,16],[23,1,23,2],[23,3,23,4],[23,5,23,6],[23,7,23,8],[23,9,23,10],[23,11,23,12],[23,13,23,14],[23,15,23,16],[22,1,22,2],[22,3,22,4],[22,5,22,6],[22,7,22,8],[22,9,22,10],[19,11,19,12],[19,13,19,14],[19,15,19,16],[21,1,21,2],[21,3,21,4],[21,5,21,6],[21,7,21,8],[21,9,21,10],[21,11,21,12],[21,13,21,14],[21,15,21,16],[19,1,19,2],[19,3,19,4],[19,5,19,6],[19,7,19,8],[19,9,19,10],[17,11,17,12],[17,13,17,14],[17,15,17,16],[18,1,18,2],[18,3,18,4],[18,5,18,6],[18,7,18,8],[18,9,18,10],[18,11,18,12],[18,13,18,14],[18,15,18,16],[17,1,17,2],[17,3,17,4],[17,5,17,6],[17,7,17,8],[17,9,17,10],[15,11,15,12],[15,13,15,14],[15,15,15,16],[16,1,16,2],[16,3,16,4],[16,5,16,6],[16,7,16,8],[16,9,16,10],[16,11,16,12],[16,13,16,14],[16,15,16,16],[15,1,15,2],[15,3,15,4],[15,5,15,6],[15,7,15,8],[15,9,15,10],[12,11,12,12],[12,13,12,14],[12,15,12,16],[13,1,13,2],[13,3,13,4],[13,5,13,6],[13,7,13,8],[13,9,13,10],[13,11,13,12],[13,13,13,14],[13,15,13,16],[12,1,12,2],[12,3,12,4],[12,5,12,6],[12,7,12,8],[12,9,12,10],[10,11,10,12],[10,13,10,14],[10,15,10,16],[11,1,11,2],[11,3,11,4],[11,5,11,6],[11,7,11,8],[11,9,11,10],[11,11,11,12],[11,13,11,14],[11,15,11,16],[10,1,10,2],[10,3,10,4],[10,5,10,6],[10,7,10,8],[10,9,10,10],[7,11,7,12],[7,13,7,14],[7,15,7,16],[9,1,9,2],[9,3,9,4],[9,5,9,6],[9,7,9,8],[9,9,9,10],[9,11,9,12],[9,13,9,14],[9,15,9,16],[7,1,7,2],[7,3,7,4],[7,5,7,6],[7,7,7,8],[7,9,7,10],[6,1,6,2],[6,3,6,4],[6,5,6,6],[6,7,6,8],[6,9,6,10],[6,11,6,12],[6,13,6,14],[6,15,6,16],[5,1,5,2],[5,3,5,4],[5,5,5,6],[5,7,5,8],[5,9,5,10],[4,11,4,12],[4,13,4,14],[4,15,4,16],[3,1,3,2],[3,3,3,4],[3,5,3,6],[3,7,3,8],[3,9,3,10],[5,11,5,12],[5,13,5,14],[5,15,5,16],[3,11,3,12],[3,13,3,14],[3,15,3,16],[4,1,4,2],[4,3,4,4],[4,5,4,6],[4,7,4,8],[4,9,4,10],[0,9,0,11],[1,15,1,16],[1,9,1,10],[1,11,1,12],[1,13,1,14],[1,1,1,2],[1,3,1,4],[1,5,1,6],[1,7,1,8],[0,3,0,8]]}
[null,null,null,{"$f":"DATE(Cal!M3,2,1)","v":"2010-02-01"},null,null,null,null,null,{"$f":"Cal!$M$3","v":2010}]
[null,{"$f":"DATE(2010,2,7)","v":"2010-02-07"},null,{"$f":"DATE(2010,2,1)","v":"2010-02-01"},null,{"$f":"DATE(2010,2,2)","v":"2010-02-02"},null,{"$f":"DATE(2010,2,3)","v":"2010-02-03"},null,{"$f":"DATE(2010,2,4)","v":"2010-02-04"},null,{"$f":"DATE(2010,2,5)","v":"2010-02-05"},null,{"$f":"DATE(2010,2,6)","v":"2010-02-06"},null,{"$f":"DATE(2010,2,7)","v":"2010-02-07"}]
[{"$f":"IF(N3=\"\",\"\",WEEKNUM(N3,1))","v":6},null,{"$f":"IF(ISNUMBER(B3),IFERROR(INDIRECT(CONCATENATE(Fiesta,2+MATCH(B3,Fiestas,0))),\"\"),\"\")","v":""},{"$f":"IF(WEEKDAY($D$1)=2,$D$1,\"\")","v":"2010-02-01"},{"$f":"IF(ISNUMBER(D3),IFERROR(INDIRECT(CONCATENATE(Fiesta,2+MATCH(D3,Fiestas,0))),\"\"),\"\")","v":""},{"$f":"IF(D3<>\"\",D3+1,IF(WEEKDAY($D$1)=3,$D$1,\"\"))","v":"2010-02-02"},{"$f":"IF(ISNUMBER(F3),IFERROR(INDIRECT(CONCATENATE(Fiesta,2+MATCH(F3,Fiestas,0))),\"\"),\"\")","v":""},{"$f":"IF(F3<>\"\",F3+1,IF(WEEKDAY($D$1)=4,$D$1,\"\"))","v":"2010-02-03"},{"$f":"IF(ISNUMBER(H3),IFERROR(INDIRECT(CONCATENATE(Fiesta,2+MATCH(H3,Fiestas,0))),\"\"),\"\")","v":""},{"$f":"IF(H3<>\"\",H3+1,IF(WEEKDAY($D$1)=5,$D$1,\"\"))","v":"2010-02-04"},{"$f":"IF(ISNUMBER(J3),IFERROR(INDIRECT(CONCATENATE(Fiesta,2+MATCH(J3,Fiestas,0))),\"\"),\"\")","v":""},{"$f":"IF(J3<>\"\",J3+1,IF(WEEKDAY($D$1)=6,$D$1,\"\"))","v":"2010-02-05"},{"$f":"IF(ISNUMBER(L3),IFERROR(INDIRECT(CONCATENATE(Fiesta,2+MATCH(L3,Fiestas,0))),\"\"),\"\")","v":""},{"$f":"IF(L3<>\"\",L3+1,IF(WEEKDAY($D$1)=7,$D$1,\"\"))","v":"2010-02-06"},{"$f":"IF(ISNUMBER(N3),IFERROR(INDIRECT(CONCATENATE(Fiesta,2+MATCH(N3,Fiestas,0))),\"\"),\"\")","v":""},{"$f":"IF(N3<>\"\",N3+1,IF(WEEKDAY($D$1)=1,$D$1,\"\"))","v":"2010-02-07"},{"$f":"IF(ISNUMBER(P3),IFERROR(INDIRECT(CONCATENATE(Fiesta,2+MATCH(P3,Fiestas,0))),\"\"),\"\")","v":""},{"$f":"IF(P3=\"\",\"\",WEEKNUM(P3,2))","v":6}]
[null,{"$f":"IF(ISNUMBER(B3),IFERROR(INDIRECT(CONCATENATE(Evento,1+MATCH(B3,Eventos,0))),\"\"),\"\")","v":""},null,{"$f":"IF(ISNUMBER(D3),IFERROR(INDIRECT(CONCATENATE(Evento,1+MATCH(D3,Eventos,0))),\"\"),\"\")","v":""},null,{"$f":"IF(ISNUMBER(F3),IFERROR(INDIRECT(CONCATENATE(Evento,1+MATCH(F3,Eventos,0))),\"\"),\"\")","v":""},null,{"$f":"IF(ISNUMBER(H3),IFERROR(INDIRECT(CONCATENATE(Evento,1+MATCH(H3,Eventos,0))),\"\"),\"\")","v":""},null,{"$f":"IF(ISNUMBER(J3),IFERROR(INDIRECT(CONCATENATE(Evento,1+MATCH(J3,Eventos,0))),\"\"),\"\")","v":"World Cancer Day"},null,{"$f":"IF(ISNUMBER(L3),IFERROR(INDIRECT(CONCATENATE(Evento,1+MATCH(L3,Eventos,0))),\"\"),\"\")","v":""},null,{"$f":"IF(ISNUMBER(N3),IFERROR(INDIRECT(CONCATENATE(Evento,1+MATCH(N3,Eventos,0))),\"\"),\"\")","v":""},null,{"$f":"IF(ISNUMBER(P3),IFERROR(INDIRECT(CONCATENATE(Evento,1+MATCH(P3,Eventos,0))),\"\"),\"\")","v":""}]
[null,{"$f":"IF(ISNUMBER(B3),IFERROR(INDIRECT(CONCATENATE(Agenda,1+MATCH(B3,Agendas,0))),\"\"),\"\")","v":""},null,{"$f":"IF(ISNUMBER(D3),IFERROR(INDIRECT(CONCATENATE(Agenda,1+MATCH(D3,Agendas,0))),\"\"),\"\")","v":""},null,{"$f":"IF(ISNUMBER(F3),IFERROR(INDIRECT(CONCATENATE(Agenda,1+MATCH(F3,Agendas,0))),\"\"),\"\")","v":""},null,{"$f":"IF(ISNUMBER(H3),IFERROR(INDIRECT(CONCATENATE(Agenda,1+MATCH(H3,Agendas,0))),\"\"),\"\")","v":""},null,{"$f":"IF(ISNUMBER(J3),IFERROR(INDIRECT(CONCATENATE(Agenda,1+MATCH(J3,Agendas,0))),\"\"),\"\")","v":""},null,{"$f":"IF(ISNUMBER(L3),IFERROR(INDIRECT(CONCATENATE(Agenda,1+MATCH(L3,Agendas,0))),\"\"),\"\")","v":""},null,{"$f":"IF(ISNUMBER(N3),IFERROR(INDIRECT(CONCATENATE(Agenda,1+MATCH(N3,Agendas,0))),\"\"),\"\")","v":""},null,{"$f":"IF(ISNUMBER(P3),IFERROR(INDIRECT(CONCATENATE(Agenda,1+MATCH(P3,Agendas,0))),\"\"),\"\")","v":""}]
[]
[]
[]
[{"$f":"WEEKNUM(B9,1)","v":7},{"$f":"P3","v":"2010-02-07"},{"$f":"IF(ISNUMBER(B9),IFERROR(INDIRECT(CONCATENATE(Fiesta,2+MATCH(B9,Fiestas,0))),\"\"),\"\")","v":""},{"$f":"P3+1","v":"2010-02-08"},{"$f":"IF(ISNUMBER(D9),IFERROR(INDIRECT(CONCATENATE(Fiesta,2+MATCH(D9,Fiestas,0))),\"\"),\"\")","v":""},{"$f":"D9+1","v":"2010-02-09"},{"$f":"IF(ISNUMBER(F9),IFERROR(INDIRECT(CONCATENATE(Fiesta,2+MATCH(F9,Fiestas,0))),\"\"),\"\")","v":""},{"$f":"F9+1","v":"2010-02-10"},{"$f":"IF(ISNUMBER(H9),IFERROR(INDIRECT(CONCATENATE(Fiesta,2+MATCH(H9,Fiestas,0))),\"\"),\"\")","v":""},{"$f":"H9+1","v":"2010-02-11"},{"$f":"IF(ISNUMBER(J9),IFERROR(INDIRECT(CONCATENATE(Fiesta,2+MATCH(J9,Fiestas,0))),\"\"),\"\")","v":""},{"$f":"J9+1","v":"2010-02-12"},{"$f":"IF(ISNUMBER(L9),IFERROR(INDIRECT(CONCATENATE(Fiesta,2+MATCH(L9,Fiestas,0))),\"\"),\"\")","v":""},{"$f":"L9+1","v":"2010-02-13"},{"$f":"IF(ISNUMBER(N9),IFERROR(INDIRECT(CONCATENATE(Fiesta,2+MATCH(N9,Fiestas,0))),\"\"),\"\")","v":""},{"$f":"N9+1","v":"2010-02-14"},{"$f":"IF(ISNUMBER(P9),IFERROR(INDIRECT(CONCATENATE(Fiesta,2+MATCH(P9,Fiestas,0))),\"\"),\"\")","v":""},{"$f":"WEEKNUM(D9,2)","v":7}]
[null,{"$f":"IF(ISNUMBER(B9),IFERROR(INDIRECT(CONCATENATE(Evento,1+MATCH(B9,Eventos,0))),\"\"),\"\")","v":""},null,{"$f":"IF(ISNUMBER(D9),IFERROR(INDIRECT(CONCATENATE(Evento,1+MATCH(D9,Eventos,0))),\"\"),\"\")","v":""},null,{"$f":"IF(ISNUMBER(F9),IFERROR(INDIRECT(CONCATENATE(Evento,1+MATCH(F9,Eventos,0))),\"\"),\"\")","v":""},null,{"$f":"IF(ISNUMBER(H9),IFERROR(INDIRECT(CONCATENATE(Evento,1+MATCH(H9,Eventos,0))),\"\"),\"\")","v":""},null,{"$f":"IF(ISNUMBER(J9),IFERROR(INDIRECT(CONCATENATE(Evento,1+MATCH(J9,Eventos,0))),\"\"),\"\")","v":"World Day of the Sick"},null,{"$f":"IF(ISNUMBER(L9),IFERROR(INDIRECT(CONCATENATE(Evento,1+MATCH(L9,Eventos,0))),\"\"),\"\")","v":""},null,{"$f":"IF(ISNUMBER(N9),IFERROR(INDIRECT(CONCATENATE(Evento,1+MATCH(N9,Eventos,0))),\"\"),\"\")","v":""},null,{"$f":"IF(ISNUMBER(P9),IFERROR(INDIRECT(CONCATENATE(Evento,1+MATCH(P9,Eventos,0))),\"\"),\"\")","v":"Valentines Day"}]
[null,{"$f":"IF(ISNUMBER(B9),IFERROR(INDIRECT(CONCATENATE(Agenda,1+MATCH(B9,Agendas,0))),\"\"),\"\")","v":""},null,{"$f":"IF(ISNUMBER(D9),IFERROR(INDIRECT(CONCATENATE(Agenda,1+MATCH(D9,Agendas,0))),\"\"),\"\")","v":""},null,{"$f":"IF(ISNUMBER(F9),IFERROR(INDIRECT(CONCATENATE(Agenda,1+MATCH(F9,Agendas,0))),\"\"),\"\")","v":""},null,{"$f":"IF(ISNUMBER(H9),IFERROR(INDIRECT(CONCATENATE(Agenda,1+MATCH(H9,Agendas,0))),\"\"),\"\")","v":""},null,{"$f":"IF(ISNUMBER(J9),IFERROR(INDIRECT(CONCATENATE(Agenda,1+MATCH(J9,Agendas,0))),\"\"),\"\")","v":""},null,{"$f":"IF(ISNUMBER(L9),IFERROR(INDIRECT(CONCATENATE(Agenda,1+MATCH(L9,Agendas,0))),\"\"),\"\")","v":""},null,{"$f":"IF(ISNUMBER(N9),IFERROR(INDIRECT(CONCATENATE(Agenda,1+MATCH(N9,Agendas,0))),\"\"),\"\")","v":""},null,{"$f":"IF(ISNUMBER(P9),IFERROR(INDIRECT(CONCATENATE(Agenda,1+MATCH(P9,Agendas,0))),\"\"),\"\")","v":""}]
[]
[]
[]
[{"$f":"WEEKNUM(B15,1)","v":8},{"$f":"P9","v":"2010-02-14"},{"$f":"IF(ISNUMBER(B15),IFERROR(INDIRECT(CONCATENATE(Fiesta,2+MATCH(B15,Fiestas,0))),\"\"),\"\")","v":""},{"$f":"P9+1","v":"2010-02-15"},{"$f":"IF(ISNUMBER(D15),IFERROR(INDIRECT(CONCATENATE(Fiesta,2+MATCH(D15,Fiestas,0))),\"\"),\"\")","v":"President Day"},{"$f":"D15+1","v":"2010-02-16"},{"$f":"IF(ISNUMBER(F15),IFERROR(INDIRECT(CONCATENATE(Fiesta,2+MATCH(F15,Fiestas,0))),\"\"),\"\")","v":""},{"$f":"F15+1","v":"2010-02-17"},{"$f":"IF(ISNUMBER(H15),IFERROR(INDIRECT(CONCATENATE(Fiesta,2+MATCH(H15,Fiestas,0))),\"\"),\"\")","v":""},{"$f":"H15+1","v":"2010-02-18"},{"$f":"IF(ISNUMBER(J15),IFERROR(INDIRECT(CONCATENATE(Fiesta,2+MATCH(J15,Fiestas,0))),\"\"),\"\")","v":""},{"$f":"J15+1","v":"2010-02-19"},{"$f":"IF(ISNUMBER(L15),IFERROR(INDIRECT(CONCATENATE(Fiesta,2+MATCH(L15,Fiestas,0))),\"\"),\"\")","v":""},{"$f":"L15+1","v":"2010-02-20"},{"$f":"IF(ISNUMBER(N15),IFERROR(INDIRECT(CONCATENATE(Fiesta,2+MATCH(N15,Fiestas,0))),\"\"),\"\")","v":""},{"$f":"N15+1","v":"2010-02-21"},{"$f":"IF(ISNUMBER(P15),IFERROR(INDIRECT(CONCATENATE(Fiesta,2+MATCH(P15,Fiestas,0))),\"\"),\"\")","v":""},{"$f":"WEEKNUM(D15,2)","v":8}]
[null,{"$f":"IF(ISNUMBER(B15),IFERROR(INDIRECT(CONCATENATE(Evento,1+MATCH(B15,Eventos,0))),\"\"),\"\")","v":"Valentines Day"},null,{"$f":"IF(ISNUMBER(D15),IFERROR(INDIRECT(CONCATENATE(Evento,1+MATCH(D15,Eventos,0))),\"\"),\"\")","v":""},null,{"$f":"IF(ISNUMBER(F15),IFERROR(INDIRECT(CONCATENATE(Evento,1+MATCH(F15,Eventos,0))),\"\"),\"\")","v":""},null,{"$f":"IF(ISNUMBER(H15),IFERROR(INDIRECT(CONCATENATE(Evento,1+MATCH(H15,Eventos,0))),\"\"),\"\")","v":""},null,{"$f":"IF(ISNUMBER(J15),IFERROR(INDIRECT(CONCATENATE(Evento,1+MATCH(J15,Eventos,0))),\"\"),\"\")","v":""},null,{"$f":"IF(ISNUMBER(L15),IFERROR(INDIRECT(CONCATENATE(Evento,1+MATCH(L15,Eventos,0))),\"\"),\"\")","v":""},null,{"$f":"IF(ISNUMBER(N15),IFERROR(INDIRECT(CONCATENATE(Evento,1+MATCH(N15,Eventos,0))),\"\"),\"\")","v":""},null,{"$f":"IF(ISNUMBER(P15),IFERROR(INDIRECT(CONCATENATE(Evento,1+MATCH(P15,Eventos,0))),\"\"),\"\")","v":"International Mother Language Day"}]
[null,{"$f":"IF(ISNUMBER(B15),IFERROR(INDIRECT(CONCATENATE(Agenda,1+MATCH(B15,Agendas,0))),\"\"),\"\")","v":""},null,{"$f":"IF(ISNUMBER(D15),IFERROR(INDIRECT(CONCATENATE(Agenda,1+MATCH(D15,Agendas,0))),\"\"),\"\")","v":""},null,{"$f":"IF(ISNUMBER(F15),IFERROR(INDIRECT(CONCATENATE(Agenda,1+MATCH(F15,Agendas,0))),\"\"),\"\")","v":""},null,{"$f":"IF(ISNUMBER(H15),IFERROR(INDIRECT(CONCATENATE(Agenda,1+MATCH(H15,Agendas,0))),\"\"),\"\")","v":""},null,{"$f":"IF(ISNUMBER(J15),IFERROR(INDIRECT(CONCATENATE(Agenda,1+MATCH(J15,Agendas,0))),\"\"),\"\")","v":""},null,{"$f":"IF(ISNUMBER(L15),IFERROR(INDIRECT(CONCATENATE(Agenda,1+MATCH(L15,Agendas,0))),\"\"),\"\")","v":""},null,{"$f":"IF(ISNUMBER(N15),IFERROR(INDIRECT(CONCATENATE(Agenda,1+MATCH(N15,Agendas,0))),\"\"),\"\")","v":""},null,{"$f":"IF(ISNUMBER(P15),IFERROR(INDIRECT(CONCATENATE(Agenda,1+MATCH(P15,Agendas,0))),\"\"),\"\")","v":""}]
[]
[]
[]
[{"$f":"WEEKNUM(B21,1)","v":9},{"$f":"P15","v":"2010-02-21"},{"$f":"IF(ISNUMBER(B21),IFERROR(INDIRECT(CONCATENATE(Fiesta,2+MATCH(B21,Fiestas,0))),\"\"),\"\")","v":""},{"$f":"P15+1","v":"2010-02-22"},{"$f":"IF(ISNUMBER(D21),IFERROR(INDIRECT(CONCATENATE(Fiesta,2+MATCH(D21,Fiestas,0))),\"\"),\"\")","v":""},{"$f":"D21+1","v":"2010-02-23"},{"$f":"IF(ISNUMBER(F21),IFERROR(INDIRECT(CONCATENATE(Fiesta,2+MATCH(F21,Fiestas,0))),\"\"),\"\")","v":""},{"$f":"F21+1","v":"2010-02-24"},{"$f":"IF(ISNUMBER(H21),IFERROR(INDIRECT(CONCATENATE(Fiesta,2+MATCH(H21,Fiestas,0))),\"\"),\"\")","v":""},{"$f":"H21+1","v":"2010-02-25"},{"$f":"IF(ISNUMBER(J21),IFERROR(INDIRECT(CONCATENATE(Fiesta,2+MATCH(J21,Fiestas,0))),\"\"),\"\")","v":""},{"$f":"J21+1","v":"2010-02-26"},{"$f":"IF(ISNUMBER(L21),IFERROR(INDIRECT(CONCATENATE(Fiesta,2+MATCH(L21,Fiestas,0))),\"\"),\"\")","v":""},{"$f":"L21+1","v":"2010-02-27"},{"$f":"IF(ISNUMBER(N21),IFERROR(INDIRECT(CONCATENATE(Fiesta,2+MATCH(N21,Fiestas,0))),\"\"),\"\")","v":""},{"$f":"N21+1","v":"2010-02-28"},{"$f":"IF(ISNUMBER(P21),IFERROR(INDIRECT(CONCATENATE(Fiesta,2+MATCH(P21,Fiestas,0))),\"\"),\"\")","v":""},{"$f":"WEEKNUM(D21,2)","v":9}]
[null,{"$f":"IF(ISNUMBER(B21),IFERROR(INDIRECT(CONCATENATE(Evento,1+MATCH(B21,Eventos,0))),\"\"),\"\")","v":"International Mother Language Day"},null,{"$f":"IF(ISNUMBER(D21),IFERROR(INDIRECT(CONCATENATE(Evento,1+MATCH(D21,Eventos,0))),\"\"),\"\")","v":""},null,{"$f":"IF(ISNUMBER(F21),IFERROR(INDIRECT(CONCATENATE(Evento,1+MATCH(F21,Eventos,0))),\"\"),\"\")","v":""},null,{"$f":"IF(ISNUMBER(H21),IFERROR(INDIRECT(CONCATENATE(Evento,1+MATCH(H21,Eventos,0))),\"\"),\"\")","v":""},null,{"$f":"IF(ISNUMBER(J21),IFERROR(INDIRECT(CONCATENATE(Evento,1+MATCH(J21,Eventos,0))),\"\"),\"\")","v":""},null,{"$f":"IF(ISNUMBER(L21),IFERROR(INDIRECT(CONCATENATE(Evento,1+MATCH(L21,Eventos,0))),\"\"),\"\")","v":""},null,{"$f":"IF(ISNUMBER(N21),IFERROR(INDIRECT(CONCATENATE(Evento,1+MATCH(N21,Eventos,0))),\"\"),\"\")","v":""},null,{"$f":"IF(ISNUMBER(P21),IFERROR(INDIRECT(CONCATENATE(Evento,1+MATCH(P21,Eventos,0))),\"\"),\"\")","v":""}]
[null,{"$f":"IF(ISNUMBER(B21),IFERROR(INDIRECT(CONCATENATE(Agenda,1+MATCH(B21,Agendas,0))),\"\"),\"\")","v":""},null,{"$f":"IF(ISNUMBER(D21),IFERROR(INDIRECT(CONCATENATE(Agenda,1+MATCH(D21,Agendas,0))),\"\"),\"\")","v":""},null,{"$f":"IF(ISNUMBER(F21),IFERROR(INDIRECT(CONCATENATE(Agenda,1+MATCH(F21,Agendas,0))),\"\"),\"\")","v":""},null,{"$f":"IF(ISNUMBER(H21),IFERROR(INDIRECT(CONCATENATE(Agenda,1+MATCH(H21,Agendas,0))),\"\"),\"\")","v":""},null,{"$f":"IF(ISNUMBER(J21),IFERROR(INDIRECT(CONCATENATE(Agenda,1+MATCH(J21,Agendas,0))),\"\"),\"\")","v":""},null,{"$f":"IF(ISNUMBER(L21),IFERROR(INDIRECT(CONCATENATE(Agenda,1+MATCH(L21,Agendas,0))),\"\"),\"\")","v":""},null,{"$f":"IF(ISNUMBER(N21),IFERROR(INDIRECT(CONCATENATE(Agenda,1+MATCH(N21,Agendas,0))),\"\"),\"\")","v":""},null,{"$f":"IF(ISNUMBER(P21),IFERROR(INDIRECT(CONCATENATE(Agenda,1+MATCH(P21,Agendas,0))),\"\"),\"\")","v":""}]
[]
[]
[]
[{"$f":"IF(B27=\"\",\"\",WEEKNUM(B27,1))","v":10},{"$f":"P21","v":"2010-02-28"},{"$f":"IF(ISNUMBER(B27),IFERROR(INDIRECT(CONCATENATE(Fiesta,2+MATCH(B27,Fiestas,0))),\"\"),\"\")","v":""},{"$f":"IF(P21<EOMONTH($D$1,0),P21+1,\"\")","v":""},{"$f":"IF(ISNUMBER(D27),IFERROR(INDIRECT(CONCATENATE(Fiesta,2+MATCH(D27,Fiestas,0))),\"\"),\"\")","v":""},{"$f":"IF(D27<EOMONTH($D$1,0),D27+1,\"\")","v":""},{"$f":"IF(ISNUMBER(F27),IFERROR(INDIRECT(CONCATENATE(Fiesta,2+MATCH(F27,Fiestas,0))),\"\"),\"\")","v":""},{"$f":"IF(F27<EOMONTH($D$1,0),F27+1,\"\")","v":""},{"$f":"IF(ISNUMBER(H27),IFERROR(INDIRECT(CONCATENATE(Fiesta,2+MATCH(H27,Fiestas,0))),\"\"),\"\")","v":""},{"$f":"IF(H27<EOMONTH($D$1,0),H27+1,\"\")","v":""},{"$f":"IF(ISNUMBER(J27),IFERROR(INDIRECT(CONCATENATE(Fiesta,2+MATCH(J27,Fiestas,0))),\"\"),\"\")","v":""},{"$f":"IF(J27<EOMONTH($D$1,0),J27+1,\"\")","v":""},{"$f":"IF(ISNUMBER(L27),IFERROR(INDIRECT(CONCATENATE(Fiesta,2+MATCH(L27,Fiestas,0))),\"\"),\"\")","v":""},{"$f":"IF(L27<EOMONTH($D$1,0),L27+1,\"\")","v":""},{"$f":"IF(ISNUMBER(N27),IFERROR(INDIRECT(CONCATENATE(Fiesta,2+MATCH(N27,Fiestas,0))),\"\"),\"\")","v":""},{"$f":"IF(N27<EOMONTH($D$1,0),N27+1,\"\")","v":""},{"$f":"IF(ISNUMBER(P27),IFERROR(INDIRECT(CONCATENATE(Fiesta,2+MATCH(P27,Fiestas,0))),\"\"),\"\")","v":""},{"$f":"IF(D27=\"\",\"\",WEEKNUM(D27,2))","v":""}]
[null,{"$f":"IF(ISNUMBER(B27),IFERROR(INDIRECT(CONCATENATE(Evento,1+MATCH(B27,Eventos,0))),\"\"),\"\")","v":""},null,{"$f":"IF(ISNUMBER(D27),IFERROR(INDIRECT(CONCATENATE(Evento,1+MATCH(D27,Eventos,0))),\"\"),\"\")","v":""},null,{"$f":"IF(ISNUMBER(F27),IFERROR(INDIRECT(CONCATENATE(Evento,1+MATCH(F27,Eventos,0))),\"\"),\"\")","v":""},null,{"$f":"IF(ISNUMBER(H27),IFERROR(INDIRECT(CONCATENATE(Evento,1+MATCH(H27,Eventos,0))),\"\"),\"\")","v":""},null,{"$f":"IF(ISNUMBER(J27),IFERROR(INDIRECT(CONCATENATE(Evento,1+MATCH(J27,Eventos,0))),\"\"),\"\")","v":""},null,{"$f":"IF(ISNUMBER(L27),IFERROR(INDIRECT(CONCATENATE(Evento,1+MATCH(L27,Eventos,0))),\"\"),\"\")","v":""},null,{"$f":"IF(ISNUMBER(N27),IFERROR(INDIRECT(CONCATENATE(Evento,1+MATCH(N27,Eventos,0))),\"\"),\"\")","v":""},null,{"$f":"IF(ISNUMBER(P27),IFERROR(INDIRECT(CONCATENATE(Evento,1+MATCH(P27,Eventos,0))),\"\"),\"\")","v":""}]
[null,{"$f":"IF(ISNUMBER(B27),IFERROR(INDIRECT(CONCATENATE(Agenda,1+MATCH(B27,Agendas,0))),\"\"),\"\")","v":""},null,{"$f":"IF(ISNUMBER(D27),IFERROR(INDIRECT(CONCATENATE(Agenda,1+MATCH(D27,Agendas,0))),\"\"),\"\")","v":""},null,{"$f":"IF(ISNUMBER(F27),IFERROR(INDIRECT(CONCATENATE(Agenda,1+MATCH(F27,Agendas,0))),\"\"),\"\")","v":""},null,{"$f":"IF(ISNUMBER(H27),IFERROR(INDIRECT(CONCATENATE(Agenda,1+MATCH(H27,Agendas,0))),\"\"),\"\")","v":""},null,{"$f":"IF(ISNUMBER(J27),IFERROR(INDIRECT(CONCATENATE(Agenda,1+MATCH(J27,Agendas,0))),\"\"),\"\")","v":""},null,{"$f":"IF(ISNUMBER(L27),IFERROR(INDIRECT(CONCATENATE(Agenda,1+MATCH(L27,Agendas,0))),\"\"),\"\")","v":""},null,{"$f":"IF(ISNUMBER(N27),IFERROR(INDIRECT(CONCATENATE(Agenda,1+MATCH(N27,Agendas,0))),\"\"),\"\")","v":""},null,{"$f":"IF(ISNUMBER(P27),IFERROR(INDIRECT(CONCATENATE(Agenda,1+MATCH(P27,Agendas,0))),\"\"),\"\")","v":""}]
[]
[]
[]
[{"$f":"IF(B33=\"\",\"\",WEEKNUM(B33,1))","v":""},{"$f":"P27","v":""},{"$f":"IF(ISNUMBER(B33),IFERROR(INDIRECT(CONCATENATE(Fiesta,2+MATCH(B33,Fiestas,0))),\"\"),\"\")","v":""},{"$f":"IF(P27<EOMONTH($D$1,0),P27+1,\"\")","v":""},{"$f":"IF(ISNUMBER(D33),IFERROR(INDIRECT(CONCATENATE(Fiesta,2+MATCH(D33,Fiestas,0))),\"\"),\"\")","v":""},{"$f":"IF(D33<EOMONTH($D$1,0),D33+1,\"\")","v":""},{"$f":"IF(ISNUMBER(F33),IFERROR(INDIRECT(CONCATENATE(Fiesta,2+MATCH(F33,Fiestas,0))),\"\"),\"\")","v":""},"Notes:",null,null,null,null,null,null,null,null,null,{"$f":"IF(D33=\"\",\"\",WEEKNUM(D33,2))","v":""}]
[null,{"$f":"IF(ISNUMBER(B33),IFERROR(INDIRECT(CONCATENATE(Evento,1+MATCH(B33,Eventos,0))),\"\"),\"\")","v":""},null,{"$f":"IF(ISNUMBER(D33),IFERROR(INDIRECT(CONCATENATE(Evento,1+MATCH(D33,Eventos,0))),\"\"),\"\")","v":""},null,{"$f":"IF(ISNUMBER(F33),IFERROR(INDIRECT(CONCATENATE(Evento,1+MATCH(F33,Eventos,0))),\"\"),\"\")","v":""}]
[null,{"$f":"IF(ISNUMBER(B33),IFERROR(INDIRECT(CONCATENATE(Agenda,1+MATCH(B33,Agendas,0))),\"\"),\"\")","v":""},null,{"$f":"IF(ISNUMBER(D33),IFERROR(INDIRECT(CONCATENATE(Agenda,1+MATCH(D33,Agendas,0))),\"\"),\"\")","v":""},null,{"$f":"IF(ISNUMBER(F33),IFERROR(INDIRECT(CONCATENATE(Agenda,1+MATCH(F33,Agendas,0))),\"\"),\"\")","v":""}]

{"sheet":"Mar","index":6,"n_rows":35,"n_cols":18,"rows_kept":35,"cut":false,"hidden":false,"merged":[[36,7,36,8],[36,9,36,10],[36,11,36,12],[37,7,37,8],[37,9,37,10],[37,11,37,12],[36,13,36,16],[37,13,37,16],[34,7,34,8],[34,9,34,10],[34,11,34,12],[34,13,34,14],[34,15,34,16],[35,7,35,8],[35,9,35,10],[35,11,35,12],[35,13,35,14],[35,15,35,16],[37,1,37,2],[37,3,37,4],[37,5,37,6],[36,1,36,2],[36,3,36,4],[36,5,36,6],[35,1,35,2],[35,3,35,4],[35,5,35,6],[34,1,34,2],[34,3,34,4],[34,5,34,6],[31,11,31,12],[31,13,31,14],[31,15,31,16],[33,1,33,2],[33,3,33,4],[33,5,33,6],[31,1,31,2],[31,3,31,4],[31,5,31,6],[31,7,31,8],[31,9,31,10],[32,7,32,8],[32,9,32,10],[32,11,32,12],[32,13,32,14],[32,15,32,16],[33,7,33,8],[33,9,33,10],[33,11,33,12],[33,13,33,14],[33,15,33,16],[29,11,29,12],[29,13,29,14],[29,15,29,16],[30,1,30,2],[30,3,30,4],[30,5,30,6],[30,7,30,8],[30,9,30,10],[30,11,30,12],[30,13,30,14],[30,15,30,16],[29,1,29,2],[29,3,29,4],[29,5,29,6],[29,7,29,8],[29,9,29,10],[27,11,27,12],[27,13,27,14],[27,15,27,16],[28,1,28,2],[28,3,28,4],[28,5,28,6],[28,7,28,8],[28,9,28,10],[28,11,28,12],[28,13,28,14],[28,15,28,16],[27,1,27,2],[27,3,27,4],[27,5,27,6],[27,7,27,8],[27,9,27,10],[24,11,24,12],[24,13,24,14],[24,15,24,16],[25,1,25,2],[25,3,25,4],[25,5,25,6],[25,7,25,8],[25,9,25,10],[25,11,25,12],[25,13,25,14],[25,15,25,16],[24,1,24,2],[24,3,24,4],[24,5,24,6],[24,7,24,8],[24,9,24,10],[22,11,22,12],[22,13,22,14],[22,15,22,16],[23,1,23,2],[23,3,23,4],[23,5,23,6],[23,7,23,8],[23,9,23,10],[23,11,23,12],[23,13,23,14],[23,15,23,16],[22,1,22,2],[22,3,22,4],[22,5,22,6],[22,7,22,8],[22,9,22,10],[19,11,19,12],[19,13,19,14],[19,15,19,16],[21,1,21,2],[21,3,21,4],[21,5,21,6],[21,7,21,8],[21,9,21,10],[21,11,21,12],[21,13,21,14],[21,15,21,16],[19,1,19,2],[19,3,19,4],[19,5,19,6],[19,7,19,8],[19,9,19,10],[17,11,17,12],[17,13,17,14],[17,15,17,16],[18,1,18,2],[18,3,18,4],[18,5,18,6],[18,7,18,8],[18,9,18,10],[18,11,18,12],[18,13,18,14],[18,15,18,16],[17,1,17,2],[17,3,17,4],[17,5,17,6],[17,7,17,8],[17,9,17,10],[15,11,15,12],[15,13,15,14],[15,15,15,16],[16,1,16,2],[16,3,16,4],[16,5,16,6],[16,7,16,8],[16,9,16,10],[16,11,16,12],[16,13,16,14],[16,15,16,16],[15,1,15,2],[15,3,15,4],[15,5,15,6],[15,7,15,8],[15,9,15,10],[12,11,12,12],[12,13,12,14],[12,15,12,16],[13,1,13,2],[13,3,13,4],[13,5,13,6],[13,7,13,8],[13,9,13,10],[13,11,13,12],[13,13,13,14],[13,15,13,16],[12,1,12,2],[12,3,12,4],[12,5,12,6],[12,7,12,8],[12,9,12,10],[10,11,10,12],[10,13,10,14],[10,15,10,16],[11,1,11,2],[11,3,11,4],[11,5,11,6],[11,7,11,8],[11,9,11,10],[11,11,11,12],[11,13,11,14],[11,15,11,16],[10,1,10,2],[10,3,10,4],[10,5,10,6],[10,7,10,8],[10,9,10,10],[7,11,7,12],[7,13,7,14],[7,15,7,16],[9,1,9,2],[9,3,9,4],[9,5,9,6],[9,7,9,8],[9,9,9,10],[9,11,9,12],[9,13,9,14],[9,15,9,16],[7,1,7,2],[7,3,7,4],[7,5,7,6],[7,7,7,8],[7,9,7,10],[5,11,5,12],[5,13,5,14],[5,15,5,16],[6,1,6,2],[6,3,6,4],[6,5,6,6],[6,7,6,8],[6,9,6,10],[6,11,6,12],[6,13,6,14],[6,15,6,16],[5,1,5,2],[5,3,5,4],[5,5,5,6],[5,7,5,8],[5,9,5,10],[0,9,0,11],[1,1,1,2],[1,3,1,4],[1,5,1,6],[1,7,1,8],[1,9,1,10],[1,11,1,12],[1,13,1,14],[0,3,0,8],[1,15,1,16],[3,11,3,12],[3,13,3,14],[3,15,3,16],[4,1,4,2],[4,3,4,4],[4,5,4,6],[4,7,4,8],[4,9,4,10],[4,11,4,12],[4,13,4,14],[4,15,4,16],[3,1,3,2],[3,3,3,4],[3,5,3,6],[3,7,3,8],[3,9,3,10]]}
[null,null,null,{"$f":"DATE(Cal!M3,3,1)","v":"2010-03-01"},null,null,null,null,null,{"$f":"Cal!$M$3","v":2010}]
[null,{"$f":"DATE(2010,2,7)","v":"2010-02-07"},null,{"$f":"DATE(2010,2,1)","v":"2010-02-01"},null,{"$f":"DATE(2010,2,2)","v":"2010-02-02"},null,{"$f":"DATE(2010,2,3)","v":"2010-02-03"},null,{"$f":"DATE(2010,2,4)","v":"2010-02-04"},null,{"$f":"DATE(2010,2,5)","v":"2010-02-05"},null,{"$f":"DATE(2010,2,6)","v":"2010-02-06"},null,{"$f":"DATE(2010,2,7)","v":"2010-02-07"}]
[{"$f":"IF(N3=\"\",\"\",WEEKNUM(N3,1))","v":10},null,{"$f":"IF(ISNUMBER(B3),IFERROR(INDIRECT(CONCATENATE(Fiesta,2+MATCH(B3,Fiestas,0))),\"\"),\"\")","v":""},{"$f":"IF(WEEKDAY($D$1)=2,$D$1,\"\")","v":"2010-03-01"},{"$f":"IF(ISNUMBER(D3),IFERROR(INDIRECT(CONCATENATE(Fiesta,2+MATCH(D3,Fiestas,0))),\"\"),\"\")","v":""},{"$f":"IF(D3<>\"\",D3+1,IF(WEEKDAY($D$1)=3,$D$1,\"\"))","v":"2010-03-02"},{"$f":"IF(ISNUMBER(F3),IFERROR(INDIRECT(CONCATENATE(Fiesta,2+MATCH(F3,Fiestas,0))),\"\"),\"\")","v":""},{"$f":"IF(F3<>\"\",F3+1,IF(WEEKDAY($D$1)=4,$D$1,\"\"))","v":"2010-03-03"},{"$f":"IF(ISNUMBER(H3),IFERROR(INDIRECT(CONCATENATE(Fiesta,2+MATCH(H3,Fiestas,0))),\"\"),\"\")","v":""},{"$f":"IF(H3<>\"\",H3+1,IF(WEEKDAY($D$1)=5,$D$1,\"\"))","v":"2010-03-04"},{"$f":"IF(ISNUMBER(J3),IFERROR(INDIRECT(CONCATENATE(Fiesta,2+MATCH(J3,Fiestas,0))),\"\"),\"\")","v":""},{"$f":"IF(J3<>\"\",J3+1,IF(WEEKDAY($D$1)=6,$D$1,\"\"))","v":"2010-03-05"},{"$f":"IF(ISNUMBER(L3),IFERROR(INDIRECT(CONCATENATE(Fiesta,2+MATCH(L3,Fiestas,0))),\"\"),\"\")","v":""},{"$f":"IF(L3<>\"\",L3+1,IF(WEEKDAY($D$1)=7,$D$1,\"\"))","v":"2010-03-06"},{"$f":"IF(ISNUMBER(N3),IFERROR(INDIRECT(CONCATENATE(Fiesta,2+MATCH(N3,Fiestas,0))),\"\"),\"\")","v":""},{"$f":"IF(N3<>\"\",N3+1,IF(WEEKDAY($D$1)=1,$D$1,\"\"))","v":"2010-03-07"},{"$f":"IF(ISNUMBER(P3),IFERROR(INDIRECT(CONCATENATE(Fiesta,2+MATCH(P3,Fiestas,0))),\"\"),\"\")","v":""},{"$f":"IF(P3=\"\",\"\",WEEKNUM(P3,2))","v":10}]
[null,{"$f":"IF(ISNUMBER(B3),IFERROR(INDIRECT(CONCATENATE(Evento,1+MATCH(B3,Eventos,0))),\"\"),\"\")","v":""},null,{"$f":"IF(ISNUMBER(D3),IFERROR(INDIRECT(CONCATENATE(Evento,1+MATCH(D3,Eventos,0))),\"\"),\"\")","v":""},null,{"$f":"IF(ISNUMBER(F3),IFERROR(INDIRECT(CONCATENATE(Evento,1+MATCH(F3,Eventos,0))),\"\"),\"\")","v":""},null,{"$f":"IF(ISNUMBER(H3),IFERROR(INDIRECT(CONCATENATE(Evento,1+MATCH(H3,Eventos,0))),\"\"),\"\")","v":""},null,{"$f":"IF(ISNUMBER(J3),IFERROR(INDIRECT(CONCATENATE(Evento,1+MATCH(J3,Eventos,0))),\"\"),\"\")","v":""},null,{"$f":"IF(ISNUMBER(L3),IFERROR(INDIRECT(CONCATENATE(Evento,1+MATCH(L3,Eventos,0))),\"\"),\"\")","v":""},null,{"$f":"IF(ISNUMBER(N3),IFERROR(INDIRECT(CONCATENATE(Evento,1+MATCH(N3,Eventos,0))),\"\"),\"\")","v":""},null,{"$f":"IF(ISNUMBER(P3),IFERROR(INDIRECT(CONCATENATE(Evento,1+MATCH(P3,Eventos,0))),\"\"),\"\")","v":""}]
[null,{"$f":"IF(ISNUMBER(B3),IFERROR(INDIRECT(CONCATENATE(Agenda,1+MATCH(B3,Agendas,0))),\"\"),\"\")","v":""},null,{"$f":"IF(ISNUMBER(D3),IFERROR(INDIRECT(CONCATENATE(Agenda,1+MATCH(D3,Agendas,0))),\"\"),\"\")","v":""},null,{"$f":"IF(ISNUMBER(F3),IFERROR(INDIRECT(CONCATENATE(Agenda,1+MATCH(F3,Agendas,0))),\"\"),\"\")","v":""},null,{"$f":"IF(ISNUMBER(H3),IFERROR(INDIRECT(CONCATENATE(Agenda,1+MATCH(H3,Agendas,0))),\"\"),\"\")","v":""},null,{"$f":"IF(ISNUMBER(J3),IFERROR(INDIRECT(CONCATENATE(Agenda,1+MATCH(J3,Agendas,0))),\"\"),\"\")","v":""},null,{"$f":"IF(ISNUMBER(L3),IFERROR(INDIRECT(CONCATENATE(Agenda,1+MATCH(L3,Agendas,0))),\"\"),\"\")","v":""},null,{"$f":"IF(ISNUMBER(N3),IFERROR(INDIRECT(CONCATENATE(Agenda,1+MATCH(N3,Agendas,0))),\"\"),\"\")","v":""},null,{"$f":"IF(ISNUMBER(P3),IFERROR(INDIRECT(CONCATENATE(Agenda,1+MATCH(P3,Agendas,0))),\"\"),\"\")","v":""}]
[]
[]
[]
[{"$f":"WEEKNUM(B9,1)","v":11},{"$f":"P3","v":"2010-03-07"},{"$f":"IF(ISNUMBER(B9),IFERROR(INDIRECT(CONCATENATE(Fiesta,2+MATCH(B9,Fiestas,0))),\"\"),\"\")","v":""},{"$f":"P3+1","v":"2010-03-08"},{"$f":"IF(ISNUMBER(D9),IFERROR(INDIRECT(CONCATENATE(Fiesta,2+MATCH(D9,Fiestas,0))),\"\"),\"\")","v":""},{"$f":"D9+1","v":"2010-03-09"},{"$f":"IF(ISNUMBER(F9),IFERROR(INDIRECT(CONCATENATE(Fiesta,2+MATCH(F9,Fiestas,0))),\"\"),\"\")","v":""},{"$f":"F9+1","v":"2010-03-10"},{"$f":"IF(ISNUMBER(H9),IFERROR(INDIRECT(CONCATENATE(Fiesta,2+MATCH(H9,Fiestas,0))),\"\"),\"\")","v":""},{"$f":"H9+1","v":"2010-03-11"},{"$f":"IF(ISNUMBER(J9),IFERROR(INDIRECT(CONCATENATE(Fiesta,2+MATCH(J9,Fiestas,0))),\"\"),\"\")","v":""},{"$f":"J9+1","v":"2010-03-12"},{"$f":"IF(ISNUMBER(L9),IFERROR(INDIRECT(CONCATENATE(Fiesta,2+MATCH(L9,Fiestas,0))),\"\"),\"\")","v":""},{"$f":"L9+1","v":"2010-03-13"},{"$f":"IF(ISNUMBER(N9),IFERROR(INDIRECT(CONCATENATE(Fiesta,2+MATCH(N9,Fiestas,0))),\"\"),\"\")","v":""},{"$f":"N9+1","v":"2010-03-14"},{"$f":"IF(ISNUMBER(P9),IFERROR(INDIRECT(CONCATENATE(Fiesta,2+MATCH(P9,Fiestas,0))),\"\"),\"\")","v":""},{"$f":"WEEKNUM(D9,2)","v":11}]
[null,{"$f":"IF(ISNUMBER(B9),IFERROR(INDIRECT(CONCATENATE(Evento,1+MATCH(B9,Eventos,0))),\"\"),\"\")","v":""},null,{"$f":"IF(ISNUMBER(D9),IFERROR(INDIRECT(CONCATENATE(Evento,1+MATCH(D9,Eventos,0))),\"\"),\"\")","v":"United Nations Day for Women's Rights and International Peace"},null,{"$f":"IF(ISNUMBER(F9),IFERROR(INDIRECT(CONCATENATE(Evento,1+MATCH(F9,Eventos,0))),\"\"),\"\")","v":""},null,{"$f":"IF(ISNUMBER(H9),IFERROR(INDIRECT(CONCATENATE(Evento,1+MATCH(H9,Eventos,0))),\"\"),\"\")","v":""},null,{"$f":"IF(ISNUMBER(J9),IFERROR(INDIRECT(CONCATENATE(Evento,1+MATCH(J9,Eventos,0))),\"\"),\"\")","v":"World Kidney Day"},null,{"$f":"IF(ISNUMBER(L9),IFERROR(INDIRECT(CONCATENATE(Evento,1+MATCH(L9,Eventos,0))),\"\"),\"\")","v":"World Glaucoma Day"},null,{"$f":"IF(ISNUMBER(N9),IFERROR(INDIRECT(CONCATENATE(Evento,1+MATCH(N9,Eventos,0))),\"\"),\"\")","v":""},null,{"$f":"IF(ISNUMBER(P9),IFERROR(INDIRECT(CONCATENATE(Evento,1+MATCH(P9,Eventos,0))),\"\"),\"\")","v":""}]
[null,{"$f":"IF(ISNUMBER(B9),IFERROR(INDIRECT(CONCATENATE(Agenda,1+MATCH(B9,Agendas,0))),\"\"),\"\")","v":""},null,{"$f":"IF(ISNUMBER(D9),IFERROR(INDIRECT(CONCATENATE(Agenda,1+MATCH(D9,Agendas,0))),\"\"),\"\")","v":""},null,{"$f":"IF(ISNUMBER(F9),IFERROR(INDIRECT(CONCATENATE(Agenda,1+MATCH(F9,Agendas,0))),\"\"),\"\")","v":""},null,{"$f":"IF(ISNUMBER(H9),IFERROR(INDIRECT(CONCATENATE(Agenda,1+MATCH(H9,Agendas,0))),\"\"),\"\")","v":""},null,{"$f":"IF(ISNUMBER(J9),IFERROR(INDIRECT(CONCATENATE(Agenda,1+MATCH(J9,Agendas,0))),\"\"),\"\")","v":""},null,{"$f":"IF(ISNUMBER(L9),IFERROR(INDIRECT(CONCATENATE(Agenda,1+MATCH(L9,Agendas,0))),\"\"),\"\")","v":""},null,{"$f":"IF(ISNUMBER(N9),IFERROR(INDIRECT(CONCATENATE(Agenda,1+MATCH(N9,Agendas,0))),\"\"),\"\")","v":""},null,{"$f":"IF(ISNUMBER(P9),IFERROR(INDIRECT(CONCATENATE(Agenda,1+MATCH(P9,Agendas,0))),\"\"),\"\")","v":""}]
[]
[]
[]
[{"$f":"WEEKNUM(B15,1)","v":12},{"$f":"P9","v":"2010-03-14"},{"$f":"IF(ISNUMBER(B15),IFERROR(INDIRECT(CONCATENATE(Fiesta,2+MATCH(B15,Fiestas,0))),\"\"),\"\")","v":""},{"$f":"P9+1","v":"2010-03-15"},{"$f":"IF(ISNUMBER(D15),IFERROR(INDIRECT(CONCATENATE(Fiesta,2+MATCH(D15,Fiestas,0))),\"\"),\"\")","v":""},{"$f":"D15+1","v":"2010-03-16"},{"$f":"IF(ISNUMBER(F15),IFERROR(INDIRECT(CONCATENATE(Fiesta,2+MATCH(F15,Fiestas,0))),\"\"),\"\")","v":""},{"$f":"F15+1","v":"2010-03-17"},{"$f":"IF(ISNUMBER(H15),IFERROR(INDIRECT(CONCATENATE(Fiesta,2+MATCH(H15,Fiestas,0))),\"\"),\"\")","v":""},{"$f":"H15+1","v":"2010-03-18"},{"$f":"IF(ISNUMBER(J15),IFERROR(INDIRECT(CONCATENATE(Fiesta,2+MATCH(J15,Fiestas,0))),\"\"),\"\")","v":""},{"$f":"J15+1","v":"2010-03-19"},{"$f":"IF(ISNUMBER(L15),IFERROR(INDIRECT(CONCATENATE(Fiesta,2+MATCH(L15,Fiestas,0))),\"\"),\"\")","v":""},{"$f":"L15+1","v":"2010-03-20"},{"$f":"IF(ISNUMBER(N15),IFERROR(INDIRECT(CONCATENATE(Fiesta,2+MATCH(N15,Fiestas,0))),\"\"),\"\")","v":""},{"$f":"N15+1","v":"2010-03-21"},{"$f":"IF(ISNUMBER(P15),IFERROR(INDIRECT(CONCATENATE(Fiesta,2+MATCH(P15,Fiestas,0))),\"\"),\"\")","v":""},{"$f":"WEEKNUM(D15,2)","v":12}]
[null,{"$f":"IF(ISNUMBER(B15),IFERROR(INDIRECT(CONCATENATE(Evento,1+MATCH(B15,Eventos,0))),\"\"),\"\")","v":""},null,{"$f":"IF(ISNUMBER(D15),IFERROR(INDIRECT(CONCATENATE(Evento,1+MATCH(D15,Eventos,0))),\"\"),\"\")","v":""},null,{"$f":"IF(ISNUMBER(F15),IFERROR(INDIRECT(CONCATENATE(Evento,1+MATCH(F15,Eventos,0))),\"\"),\"\")","v":""},null,{"$f":"IF(ISNUMBER(H15),IFERROR(INDIRECT(CONCATENATE(Evento,1+MATCH(H15,Eventos,0))),\"\"),\"\")","v":""},null,{"$f":"IF(ISNUMBER(J15),IFERROR(INDIRECT(CONCATENATE(Evento,1+MATCH(J15,Eventos,0))),\"\"),\"\")","v":""},null,{"$f":"IF(ISNUMBER(L15),IFERROR(INDIRECT(CONCATENATE(Evento,1+MATCH(L15,Eventos,0))),\"\"),\"\")","v":"World Sleep Day"},null,{"$f":"IF(ISNUMBER(N15),IFERROR(INDIRECT(CONCATENATE(Evento,1+MATCH(N15,Eventos,0))),\"\"),\"\")","v":""},null,{"$f":"IF(ISNUMBER(P15),IFERROR(INDIRECT(CONCATENATE(Evento,1+MATCH(P15,Eventos,0))),\"\"),\"\")","v":""}]
[null,{"$f":"IF(ISNUMBER(B15),IFERROR(INDIRECT(CONCATENATE(Agenda,1+MATCH(B15,Agendas,0))),\"\"),\"\")","v":""},null,{"$f":"IF(ISNUMBER(D15),IFERROR(INDIRECT(CONCATENATE(Agenda,1+MATCH(D15,Agendas,0))),\"\"),\"\")","v":""},null,{"$f":"IF(ISNUMBER(F15),IFERROR(INDIRECT(CONCATENATE(Agenda,1+MATCH(F15,Agendas,0))),\"\"),\"\")","v":""},null,{"$f":"IF(ISNUMBER(H15),IFERROR(INDIRECT(CONCATENATE(Agenda,1+MATCH(H15,Agendas,0))),\"\"),\"\")","v":""},null,{"$f":"IF(ISNUMBER(J15),IFERROR(INDIRECT(CONCATENATE(Agenda,1+MATCH(J15,Agendas,0))),\"\"),\"\")","v":""},null,{"$f":"IF(ISNUMBER(L15),IFERROR(INDIRECT(CONCATENATE(Agenda,1+MATCH(L15,Agendas,0))),\"\"),\"\")","v":""},null,{"$f":"IF(ISNUMBER(N15),IFERROR(INDIRECT(CONCATENATE(Agenda,1+MATCH(N15,Agendas,0))),\"\"),\"\")","v":""},null,{"$f":"IF(ISNUMBER(P15),IFERROR(INDIRECT(CONCATENATE(Agenda,1+MATCH(P15,Agendas,0))),\"\"),\"\")","v":""}]
[]
[]
[]
[{"$f":"WEEKNUM(B21,1)","v":13},{"$f":"P15","v":"2010-03-21"},{"$f":"IF(ISNUMBER(B21),IFERROR(INDIRECT(CONCATENATE(Fiesta,2+MATCH(B21,Fiestas,0))),\"\"),\"\")","v":""},{"$f":"P15+1","v":"2010-03-22"},{"$f":"IF(ISNUMBER(D21),IFERROR(INDIRECT(CONCATENATE(Fiesta,2+MATCH(D21,Fiestas,0))),\"\"),\"\")","v":""},{"$f":"D21+1","v":"2010-03-23"},{"$f":"IF(ISNUMBER(F21),IFERROR(INDIRECT(CONCATENATE(Fiesta,2+MATCH(F21,Fiestas,0))),\"\"),\"\")","v":""},{"$f":"F21+1","v":"2010-03-24"},{"$f":"IF(ISNUMBER(H21),IFERROR(INDIRECT(CONCATENATE(Fiesta,2+MATCH(H21,Fiestas,0))),\"\"),\"\")","v":""},{"$f":"H21+1","v":"2010-03-25"},{"$f":"IF(ISNUMBER(J21),IFERROR(INDIRECT(CONCATENATE(Fiesta,2+MATCH(J21,Fiestas,0))),\"\"),\"\")","v":""},{"$f":"J21+1","v":"2010-03-26"},{"$f":"IF(ISNUMBER(L21),IFERROR(INDIRECT(CONCATENATE(Fiesta,2+MATCH(L21,Fiestas,0))),\"\"),\"\")","v":""},{"$f":"L21+1","v":"2010-03-27"},{"$f":"IF(ISNUMBER(N21),IFERROR(INDIRECT(CONCATENATE(Fiesta,2+MATCH(N21,Fiestas,0))),\"\"),\"\")","v":""},{"$f":"N21+1","v":"2010-03-28"},{"$f":"IF(ISNUMBER(P21),IFERROR(INDIRECT(CONCATENATE(Fiesta,2+MATCH(P21,Fiestas,0))),\"\"),\"\")","v":""},{"$f":"WEEKNUM(D21,2)","v":13}]
[null,{"$f":"IF(ISNUMBER(B21),IFERROR(INDIRECT(CONCATENATE(Evento,1+MATCH(B21,Eventos,0))),\"\"),\"\")","v":""},null,{"$f":"IF(ISNUMBER(D21),IFERROR(INDIRECT(CONCATENATE(Evento,1+MATCH(D21,Eventos,0))),\"\"),\"\")","v":"World Day for Water"},null,{"$f":"IF(ISNUMBER(F21),IFERROR(INDIRECT(CONCATENATE(Evento,1+MATCH(F21,Eventos,0))),\"\"),\"\")","v":"World Meteorological Day"},null,{"$f":"IF(ISNUMBER(H21),IFERROR(INDIRECT(CONCATENATE(Evento,1+MATCH(H21,Eventos,0))),\"\"),\"\")","v":"World Tuberculosis Day"},null,{"$f":"IF(ISNUMBER(J21),IFERROR(INDIRECT(CONCATENATE(Evento,1+MATCH(J21,Eventos,0))),\"\"),\"\")","v":""},null,{"$f":"IF(ISNUMBER(L21),IFERROR(INDIRECT(CONCATENATE(Evento,1+MATCH(L21,Eventos,0))),\"\"),\"\")","v":""},null,{"$f":"IF(ISNUMBER(N21),IFERROR(INDIRECT(CONCATENATE(Evento,1+MATCH(N21,Eventos,0))),\"\"),\"\")","v":""},null,{"$f":"IF(ISNUMBER(P21),IFERROR(INDIRECT(CONCATENATE(Evento,1+MATCH(P21,Eventos,0))),\"\"),\"\")","v":""}]
[null,{"$f":"IF(ISNUMBER(B21),IFERROR(INDIRECT(CONCATENATE(Agenda,1+MATCH(B21,Agendas,0))),\"\"),\"\")","v":""},null,{"$f":"IF(ISNUMBER(D21),IFERROR(INDIRECT(CONCATENATE(Agenda,1+MATCH(D21,Agendas,0))),\"\"),\"\")","v":""},null,{"$f":"IF(ISNUMBER(F21),IFERROR(INDIRECT(CONCATENATE(Agenda,1+MATCH(F21,Agendas,0))),\"\"),\"\")","v":""},null,{"$f":"IF(ISNUMBER(H21),IFERROR(INDIRECT(CONCATENATE(Agenda,1+MATCH(H21,Agendas,0))),\"\"),\"\")","v":""},null,{"$f":"IF(ISNUMBER(J21),IFERROR(INDIRECT(CONCATENATE(Agenda,1+MATCH(J21,Agendas,0))),\"\"),\"\")","v":""},null,{"$f":"IF(ISNUMBER(L21),IFERROR(INDIRECT(CONCATENATE(Agenda,1+MATCH(L21,Agendas,0))),\"\"),\"\")","v":""},null,{"$f":"IF(ISNUMBER(N21),IFERROR(INDIRECT(CONCATENATE(Agenda,1+MATCH(N21,Agendas,0))),\"\"),\"\")","v":""},null,{"$f":"IF(ISNUMBER(P21),IFERROR(INDIRECT(CONCATENATE(Agenda,1+MATCH(P21,Agendas,0))),\"\"),\"\")","v":""}]
[]
[]
[]
[{"$f":"IF(B27=\"\",\"\",WEEKNUM(B27,1))","v":14},{"$f":"P21","v":"2010-03-28"},{"$f":"IF(ISNUMBER(B27),IFERROR(INDIRECT(CONCATENATE(Fiesta,2+MATCH(B27,Fiestas,0))),\"\"),\"\")","v":""},{"$f":"IF(P21<EOMONTH($D$1,0),P21+1,\"\")","v":"2010-03-29"},{"$f":"IF(ISNUMBER(D27),IFERROR(INDIRECT(CONCATENATE(Fiesta,2+MATCH(D27,Fiestas,0))),\"\"),\"\")","v":""},{"$f":"IF(D27<EOMONTH($D$1,0),D27+1,\"\")","v":"2010-03-30"},{"$f":"IF(ISNUMBER(F27),IFERROR(INDIRECT(CONCATENATE(Fiesta,2+MATCH(F27,Fiestas,0))),\"\"),\"\")","v":""},{"$f":"IF(F27<EOMONTH($D$1,0),F27+1,\"\")","v":"2010-03-31"},{"$f":"IF(ISNUMBER(H27),IFERROR(INDIRECT(CONCATENATE(Fiesta,2+MATCH(H27,Fiestas,0))),\"\"),\"\")","v":""},{"$f":"IF(H27<EOMONTH($D$1,0),H27+1,\"\")","v":""},{"$f":"IF(ISNUMBER(J27),IFERROR(INDIRECT(CONCATENATE(Fiesta,2+MATCH(J27,Fiestas,0))),\"\"),\"\")","v":""},{"$f":"IF(J27<EOMONTH($D$1,0),J27+1,\"\")","v":""},{"$f":"IF(ISNUMBER(L27),IFERROR(INDIRECT(CONCATENATE(Fiesta,2+MATCH(L27,Fiestas,0))),\"\"),\"\")","v":""},{"$f":"IF(L27<EOMONTH($D$1,0),L27+1,\"\")","v":""},{"$f":"IF(ISNUMBER(N27),IFERROR(INDIRECT(CONCATENATE(Fiesta,2+MATCH(N27,Fiestas,0))),\"\"),\"\")","v":""},{"$f":"IF(N27<EOMONTH($D$1,0),N27+1,\"\")","v":""},{"$f":"IF(ISNUMBER(P27),IFERROR(INDIRECT(CONCATENATE(Fiesta,2+MATCH(P27,Fiestas,0))),\"\"),\"\")","v":""},{"$f":"IF(D27=\"\",\"\",WEEKNUM(D27,2))","v":14}]
[null,{"$f":"IF(ISNUMBER(B27),IFERROR(INDIRECT(CONCATENATE(Evento,1+MATCH(B27,Eventos,0))),\"\"),\"\")","v":""},null,{"$f":"IF(ISNUMBER(D27),IFERROR(INDIRECT(CONCATENATE(Evento,1+MATCH(D27,Eventos,0))),\"\"),\"\")","v":""},null,{"$f":"IF(ISNUMBER(F27),IFERROR(INDIRECT(CONCATENATE(Evento,1+MATCH(F27,Eventos,0))),\"\"),\"\")","v":""},null,{"$f":"IF(ISNUMBER(H27),IFERROR(INDIRECT(CONCATENATE(Evento,1+MATCH(H27,Eventos,0))),\"\"),\"\")","v":""},null,{"$f":"IF(ISNUMBER(J27),IFERROR(INDIRECT(CONCATENATE(Evento,1+MATCH(J27,Eventos,0))),\"\"),\"\")","v":""},null,{"$f":"IF(ISNUMBER(L27),IFERROR(INDIRECT(CONCATENATE(Evento,1+MATCH(L27,Eventos,0))),\"\"),\"\")","v":""},null,{"$f":"IF(ISNUMBER(N27),IFERROR(INDIRECT(CONCATENATE(Evento,1+MATCH(N27,Eventos,0))),\"\"),\"\")","v":""},null,{"$f":"IF(ISNUMBER(P27),IFERROR(INDIRECT(CONCATENATE(Evento,1+MATCH(P27,Eventos,0))),\"\"),\"\")","v":""}]
[null,{"$f":"IF(ISNUMBER(B27),IFERROR(INDIRECT(CONCATENATE(Agenda,1+MATCH(B27,Agendas,0))),\"\"),\"\")","v":""},null,{"$f":"IF(ISNUMBER(D27),IFERROR(INDIRECT(CONCATENATE(Agenda,1+MATCH(D27,Agendas,0))),\"\"),\"\")","v":""},null,{"$f":"IF(ISNUMBER(F27),IFERROR(INDIRECT(CONCATENATE(Agenda,1+MATCH(F27,Agendas,0))),\"\"),\"\")","v":""},null,{"$f":"IF(ISNUMBER(H27),IFERROR(INDIRECT(CONCATENATE(Agenda,1+MATCH(H27,Agendas,0))),\"\"),\"\")","v":""},null,{"$f":"IF(ISNUMBER(J27),IFERROR(INDIRECT(CONCATENATE(Agenda,1+MATCH(J27,Agendas,0))),\"\"),\"\")","v":""},null,{"$f":"IF(ISNUMBER(L27),IFERROR(INDIRECT(CONCATENATE(Agenda,1+MATCH(L27,Agendas,0))),\"\"),\"\")","v":""},null,{"$f":"IF(ISNUMBER(N27),IFERROR(INDIRECT(CONCATENATE(Agenda,1+MATCH(N27,Agendas,0))),\"\"),\"\")","v":""},null,{"$f":"IF(ISNUMBER(P27),IFERROR(INDIRECT(CONCATENATE(Agenda,1+MATCH(P27,Agendas,0))),\"\"),\"\")","v":""}]
[]
[]
[]
[{"$f":"IF(B33=\"\",\"\",WEEKNUM(B33,1))","v":""},{"$f":"P27","v":""},{"$f":"IF(ISNUMBER(B33),IFERROR(INDIRECT(CONCATENATE(Fiesta,2+MATCH(B33,Fiestas,0))),\"\"),\"\")","v":""},{"$f":"IF(P27<EOMONTH($D$1,0),P27+1,\"\")","v":""},{"$f":"IF(ISNUMBER(D33),IFERROR(INDIRECT(CONCATENATE(Fiesta,2+MATCH(D33,Fiestas,0))),\"\"),\"\")","v":""},{"$f":"IF(D33<EOMONTH($D$1,0),D33+1,\"\")","v":""},{"$f":"IF(ISNUMBER(F33),IFERROR(INDIRECT(CONCATENATE(Fiesta,2+MATCH(F33,Fiestas,0))),\"\"),\"\")","v":""},"Notes:",null,null,null,null,null,null,null,null,null,{"$f":"IF(D33=\"\",\"\",WEEKNUM(D33,2))","v":""}]
[null,{"$f":"IF(ISNUMBER(B33),IFERROR(INDIRECT(CONCATENATE(Evento,1+MATCH(B33,Eventos,0))),\"\"),\"\")","v":""},null,{"$f":"IF(ISNUMBER(D33),IFERROR(INDIRECT(CONCATENATE(Evento,1+MATCH(D33,Eventos,0))),\"\"),\"\")","v":""},null,{"$f":"IF(ISNUMBER(F33),IFERROR(INDIRECT(CONCATENATE(Evento,1+MATCH(F33,Eventos,0))),\"\"),\"\")","v":""}]
[null,{"$f":"IF(ISNUMBER(B33),IFERROR(INDIRECT(CONCATENATE(Agenda,1+MATCH(B33,Agendas,0))),\"\"),\"\")","v":""},null,{"$f":"IF(ISNUMBER(D33),IFERROR(INDIRECT(CONCATENATE(Agenda,1+MATCH(D33,Agendas,0))),\"\"),\"\")","v":""},null,{"$f":"IF(ISNUMBER(F33),IFERROR(INDIRECT(CONCATENATE(Agenda,1+MATCH(F33,Agendas,0))),\"\"),\"\")","v":""}]

{"sheet":"Apr","index":7,"n_rows":35,"n_cols":18,"rows_kept":35,"cut":false,"hidden":false,"merged":[[36,7,36,8],[36,9,36,10],[36,11,36,12],[37,7,37,8],[37,9,37,10],[37,11,37,12],[36,13,36,16],[37,13,37,16],[34,7,34,8],[34,9,34,10],[34,11,34,12],[34,13,34,14],[34,15,34,16],[35,7,35,8],[35,9,35,10],[35,11,35,12],[35,13,35,14],[35,15,35,16],[37,1,37,2],[37,3,37,4],[37,5,37,6],[36,1,36,2],[36,3,36,4],[36,5,36,6],[35,1,35,2],[35,3,35,4],[35,5,35,6],[34,1,34,2],[34,3,34,4],[34,5,34,6],[31,11,31,12],[31,13,31,14],[31,15,31,16],[33,1,33,2],[33,3,33,4],[33,5,33,6],[31,1,31,2],[31,3,31,4],[31,5,31,6],[31,7,31,8],[31,9,31,10],[32,7,32,8],[32,9,32,10],[32,11,32,12],[32,13,32,14],[32,15,32,16],[33,7,33,8],[33,9,33,10],[33,11,33,12],[33,13,33,14],[33,15,33,16],[29,11,29,12],[29,13,29,14],[29,15,29,16],[30,1,30,2],[30,3,30,4],[30,5,30,6],[30,7,30,8],[30,9,30,10],[30,11,30,12],[30,13,30,14],[30,15,30,16],[29,1,29,2],[29,3,29,4],[29,5,29,6],[29,7,29,8],[29,9,29,10],[27,11,27,12],[27,13,27,14],[27,15,27,16],[28,1,28,2],[28,3,28,4],[28,5,28,6],[28,7,28,8],[28,9,28,10],[28,11,28,12],[28,13,28,14],[28,15,28,16],[27,1,27,2],[27,3,27,4],[27,5,27,6],[27,7,27,8],[27,9,27,10],[24,11,24,12],[24,13,24,14],[24,15,24,16],[25,1,25,2],[25,3,25,4],[25,5,25,6],[25,7,25,8],[25,9,25,10],[25,11,25,12],[25,13,25,14],[25,15,25,16],[24,1,24,2],[24,3,24,4],[24,5,24,6],[24,7,24,8],[24,9,24,10],[22,11,22,12],[22,13,22,14],[22,15,22,16],[23,1,23,2],[23,3,23,4],[23,5,23,6],[23,7,23,8],[23,9,23,10],[23,11,23,12],[23,13,23,14],[23,15,23,16],[22,1,22,2],[22,3,22,4],[22,5,22,6],[22,7,22,8],[22,9,22,10],[19,11,19,12],[19,13,19,14],[19,15,19,16],[21,1,21,2],[21,3,21,4],[21,5,21,6],[21,7,21,8],[21,9,21,10],[21,11,21,12],[21,13,21,14],[21,15,21,16],[19,1,19,2],[19,3,19,4],[19,5,19,6],[19,7,19,8],[19,9,19,10],[17,11,17,12],[17,13,17,14],[17,15,17,16],[18,1,18,2],[18,3,18,4],[18,5,18,6],[18,7,18,8],[18,9,18,10],[18,11,18,12],[18,13,18,14],[18,15,18,16],[17,1,17,2],[17,3,17,4],[17,5,17,6],[17,7,17,8],[17,9,17,10],[15,11,15,12],[15,13,15,14],[15,15,15,16],[16,1,16,2],[16,3,16,4],[16,5,16,6],[16,7,16,8],[16,9,16,10],[16,11,16,12],[16,13,16,14],[16,15,16,16],[15,1,15,2],[15,3,15,4],[15,5,15,6],[15,7,15,8],[15,9,15,10],[12,11,12,12],[12,13,12,14],[12,15,12,16],[13,1,13,2],[13,3,13,4],[13,5,13,6],[13,7,13,8],[13,9,13,10],[13,11,13,12],[13,13,13,14],[13,15,13,16],[12,1,12,2],[12,3,12,4],[12,5,12,6],[12,7,12,8],[12,9,12,10],[10,11,10,12],[10,13,10,14],[10,15,10,16],[11,1,11,2],[11,3,11,4],[11,5,11,6],[11,7,11,8],[11,9,11,10],[11,11,11,12],[11,13,11,14],[11,15,11,16],[10,1,10,2],[10,3,10,4],[10,5,10,6],[10,7,10,8],[10,9,10,10],[7,11,7,12],[7,13,7,14],[7,15,7,16],[9,1,9,2],[9,3,9,4],[9,5,9,6],[9,7,9,8],[9,9,9,10],[9,11,9,12],[9,13,9,14],[9,15,9,16],[7,1,7,2],[7,3,7,4],[7,5,7,6],[7,7,7,8],[7,9,7,10],[6,1,6,2],[6,3,6,4],[6,5,6,6],[6,7,6,8],[6,9,6,10],[6,11,6,12],[6,13,6,14],[6,15,6,16],[5,1,5,2],[5,3,5,4],[5,5,5,6],[5,7,5,8],[5,9,5,10],[4,11,4,12],[4,13,4,14],[4,15,4,16],[3,1,3,2],[3,3,3,4],[3,5,3,6],[3,7,3,8],[3,9,3,10],[5,11,5,12],[5,13,5,14],[5,15,5,16],[3,11,3,12],[3,13,3,14],[3,15,3,16],[4,1,4,2],[4,3,4,4],[4,5,4,6],[4,7,4,8],[4,9,4,10],[0,9,0,11],[1,15,1,16],[1,1,1,2],[1,3,1,4],[1,5,1,6],[1,7,1,8],[1,9,1,10],[1,11,1,12],[1,13,1,14],[0,3,0,8]]}
[null,null,null,{"$f":"DATE(Cal!M3,4,1)","v":"2010-04-01"},null,null,null,null,null,{"$f":"Cal!$M$3","v":2010}]
[null,{"$f":"DATE(2010,2,7)","v":"2010-02-07"},null,{"$f":"DATE(2010,2,1)","v":"2010-02-01"},null,{"$f":"DATE(2010,2,2)","v":"2010-02-02"},null,{"$f":"DATE(2010,2,3)","v":"2010-02-03"},null,{"$f":"DATE(2010,2,4)","v":"2010-02-04"},null,{"$f":"DATE(2010,2,5)","v":"2010-02-05"},null,{"$f":"DATE(2010,2,6)","v":"2010-02-06"},null,{"$f":"DATE(2010,2,7)","v":"2010-02-07"}]
[{"$f":"IF(N3=\"\",\"\",WEEKNUM(N3,1))","v":14},null,{"$f":"IF(ISNUMBER(B3),IFERROR(INDIRECT(CONCATENATE(Fiesta,2+MATCH(B3,Fiestas,0))),\"\"),\"\")","v":""},{"$f":"IF(WEEKDAY($D$1)=2,$D$1,\"\")","v":""},{"$f":"IF(ISNUMBER(D3),IFERROR(INDIRECT(CONCATENATE(Fiesta,2+MATCH(D3,Fiestas,0))),\"\"),\"\")","v":""},{"$f":"IF(D3<>\"\",D3+1,IF(WEEKDAY($D$1)=3,$D$1,\"\"))","v":""},{"$f":"IF(ISNUMBER(F3),IFERROR(INDIRECT(CONCATENATE(Fiesta,2+MATCH(F3,Fiestas,0))),\"\"),\"\")","v":""},{"$f":"IF(F3<>\"\",F3+1,IF(WEEKDAY($D$1)=4,$D$1,\"\"))","v":""},{"$f":"IF(ISNUMBER(H3),IFERROR(INDIRECT(CONCATENATE(Fiesta,2+MATCH(H3,Fiestas,0))),\"\"),\"\")","v":""},{"$f":"IF(H3<>\"\",H3+1,IF(WEEKDAY($D$1)=5,$D$1,\"\"))","v":"2010-04-01"},{"$f":"IF(ISNUMBER(J3),IFERROR(INDIRECT(CONCATENATE(Fiesta,2+MATCH(J3,Fiestas,0))),\"\"),\"\")","v":""},{"$f":"IF(J3<>\"\",J3+1,IF(WEEKDAY($D$1)=6,$D$1,\"\"))","v":"2010-04-02"},{"$f":"IF(ISNUMBER(L3),IFERROR(INDIRECT(CONCATENATE(Fiesta,2+MATCH(L3,Fiestas,0))),\"\"),\"\")","v":""},{"$f":"IF(L3<>\"\",L3+1,IF(WEEKDAY($D$1)=7,$D$1,\"\"))","v":"2010-04-03"},{"$f":"IF(ISNUMBER(N3),IFERROR(INDIRECT(CONCATENATE(Fiesta,2+MATCH(N3,Fiestas,0))),\"\"),\"\")","v":""},{"$f":"IF(N3<>\"\",N3+1,IF(WEEKDAY($D$1)=1,$D$1,\"\"))","v":"2010-04-04"},{"$f":"IF(ISNUMBER(P3),IFERROR(INDIRECT(CONCATENATE(Fiesta,2+MATCH(P3,Fiestas,0))),\"\"),\"\")","v":""},{"$f":"IF(P3=\"\",\"\",WEEKNUM(P3,2))","v":14}]
[null,{"$f":"IF(ISNUMBER(B3),IFERROR(INDIRECT(CONCATENATE(Evento,1+MATCH(B3,Eventos,0))),\"\"),\"\")","v":""},null,{"$f":"IF(ISNUMBER(D3),IFERROR(INDIRECT(CONCATENATE(Evento,1+MATCH(D3,Eventos,0))),\"\"),\"\")","v":""},null,{"$f":"IF(ISNUMBER(F3),IFERROR(INDIRECT(CONCATENATE(Evento,1+MATCH(F3,Eventos,0))),\"\"),\"\")","v":""},null,{"$f":"IF(ISNUMBER(H3),IFERROR(INDIRECT(CONCATENATE(Evento,1+MATCH(H3,Eventos,0))),\"\"),\"\")","v":""},null,{"$f":"IF(ISNUMBER(J3),IFERROR(INDIRECT(CONCATENATE(Evento,1+MATCH(J3,Eventos,0))),\"\"),\"\")","v":""},null,{"$f":"IF(ISNUMBER(L3),IFERROR(INDIRECT(CONCATENATE(Evento,1+MATCH(L3,Eventos,0))),\"\"),\"\")","v":"World Autism Awareness Day"},null,{"$f":"IF(ISNUMBER(N3),IFERROR(INDIRECT(CONCATENATE(Evento,1+MATCH(N3,Eventos,0))),\"\"),\"\")","v":""},null,{"$f":"IF(ISNUMBER(P3),IFERROR(INDIRECT(CONCATENATE(Evento,1+MATCH(P3,Eventos,0))),\"\"),\"\")","v":""}]
[null,{"$f":"IF(ISNUMBER(B3),IFERROR(INDIRECT(CONCATENATE(Agenda,1+MATCH(B3,Agendas,0))),\"\"),\"\")","v":""},null,{"$f":"IF(ISNUMBER(D3),IFERROR(INDIRECT(CONCATENATE(Agenda,1+MATCH(D3,Agendas,0))),\"\"),\"\")","v":""},null,{"$f":"IF(ISNUMBER(F3),IFERROR(INDIRECT(CONCATENATE(Agenda,1+MATCH(F3,Agendas,0))),\"\"),\"\")","v":""},null,{"$f":"IF(ISNUMBER(H3),IFERROR(INDIRECT(CONCATENATE(Agenda,1+MATCH(H3,Agendas,0))),\"\"),\"\")","v":""},null,{"$f":"IF(ISNUMBER(J3),IFERROR(INDIRECT(CONCATENATE(Agenda,1+MATCH(J3,Agendas,0))),\"\"),\"\")","v":""},null,{"$f":"IF(ISNUMBER(L3),IFERROR(INDIRECT(CONCATENATE(Agenda,1+MATCH(L3,Agendas,0))),\"\"),\"\")","v":""},null,{"$f":"IF(ISNUMBER(N3),IFERROR(INDIRECT(CONCATENATE(Agenda,1+MATCH(N3,Agendas,0))),\"\"),\"\")","v":""},null,{"$f":"IF(ISNUMBER(P3),IFERROR(INDIRECT(CONCATENATE(Agenda,1+MATCH(P3,Agendas,0))),\"\"),\"\")","v":""}]
[]
[]
[]
[{"$f":"WEEKNUM(B9,1)","v":15},{"$f":"P3","v":"2010-04-04"},{"$f":"IF(ISNUMBER(B9),IFERROR(INDIRECT(CONCATENATE(Fiesta,2+MATCH(B9,Fiestas,0))),\"\"),\"\")","v":""},{"$f":"P3+1","v":"2010-04-05"},{"$f":"IF(ISNUMBER(D9),IFERROR(INDIRECT(CONCATENATE(Fiesta,2+MATCH(D9,Fiestas,0))),\"\"),\"\")","v":""},{"$f":"D9+1","v":"2010-04-06"},{"$f":"IF(ISNUMBER(F9),IFERROR(INDIRECT(CONCATENATE(Fiesta,2+MATCH(F9,Fiestas,0))),\"\"),\"\")","v":""},{"$f":"F9+1","v":"2010-04-07"},{"$f":"IF(ISNUMBER(H9),IFERROR(INDIRECT(CONCATENATE(Fiesta,2+MATCH(H9,Fiestas,0))),\"\"),\"\")","v":""},{"$f":"H9+1","v":"2010-04-08"},{"$f":"IF(ISNUMBER(J9),IFERROR(INDIRECT(CONCATENATE(Fiesta,2+MATCH(J9,Fiestas,0))),\"\"),\"\")","v":""},{"$f":"J9+1","v":"2010-04-09"},{"$f":"IF(ISNUMBER(L9),IFERROR(INDIRECT(CONCATENATE(Fiesta,2+MATCH(L9,Fiestas,0))),\"\"),\"\")","v":""},{"$f":"L9+1","v":"2010-04-10"},{"$f":"IF(ISNUMBER(N9),IFERROR(INDIRECT(CONCATENATE(Fiesta,2+MATCH(N9,Fiestas,0))),\"\"),\"\")","v":""},{"$f":"N9+1","v":"2010-04-11"},{"$f":"IF(ISNUMBER(P9),IFERROR(INDIRECT(CONCATENATE(Fiesta,2+MATCH(P9,Fiestas,0))),\"\"),\"\")","v":""},{"$f":"WEEKNUM(D9,2)","v":15}]
[null,{"$f":"IF(ISNUMBER(B9),IFERROR(INDIRECT(CONCATENATE(Evento,1+MATCH(B9,Eventos,0))),\"\"),\"\")","v":""},null,{"$f":"IF(ISNUMBER(D9),IFERROR(INDIRECT(CONCATENATE(Evento,1+MATCH(D9,Eventos,0))),\"\"),\"\")","v":""},null,{"$f":"IF(ISNUMBER(F9),IFERROR(INDIRECT(CONCATENATE(Evento,1+MATCH(F9,Eventos,0))),\"\"),\"\")","v":""},null,{"$f":"IF(ISNUMBER(H9),IFERROR(INDIRECT(CONCATENATE(Evento,1+MATCH(H9,Eventos,0))),\"\"),\"\")","v":"World Health Day"},null,{"$f":"IF(ISNUMBER(J9),IFERROR(INDIRECT(CONCATENATE(Evento,1+MATCH(J9,Eventos,0))),\"\"),\"\")","v":""},null,{"$f":"IF(ISNUMBER(L9),IFERROR(INDIRECT(CONCATENATE(Evento,1+MATCH(L9,Eventos,0))),\"\"),\"\")","v":""},null,{"$f":"IF(ISNUMBER(N9),IFERROR(INDIRECT(CONCATENATE(Evento,1+MATCH(N9,Eventos,0))),\"\"),\"\")","v":""},null,{"$f":"IF(ISNUMBER(P9),IFERROR(INDIRECT(CONCATENATE(Evento,1+MATCH(P9,Eventos,0))),\"\"),\"\")","v":"World Parkinson’s Day"}]
[null,{"$f":"IF(ISNUMBER(B9),IFERROR(INDIRECT(CONCATENATE(Agenda,1+MATCH(B9,Agendas,0))),\"\"),\"\")","v":""},null,{"$f":"IF(ISNUMBER(D9),IFERROR(INDIRECT(CONCATENATE(Agenda,1+MATCH(D9,Agendas,0))),\"\"),\"\")","v":""},null,{"$f":"IF(ISNUMBER(F9),IFERROR(INDIRECT(CONCATENATE(Agenda,1+MATCH(F9,Agendas,0))),\"\"),\"\")","v":""},null,{"$f":"IF(ISNUMBER(H9),IFERROR(INDIRECT(CONCATENATE(Agenda,1+MATCH(H9,Agendas,0))),\"\"),\"\")","v":""},null,{"$f":"IF(ISNUMBER(J9),IFERROR(INDIRECT(CONCATENATE(Agenda,1+MATCH(J9,Agendas,0))),\"\"),\"\")","v":""},null,{"$f":"IF(ISNUMBER(L9),IFERROR(INDIRECT(CONCATENATE(Agenda,1+MATCH(L9,Agendas,0))),\"\"),\"\")","v":""},null,{"$f":"IF(ISNUMBER(N9),IFERROR(INDIRECT(CONCATENATE(Agenda,1+MATCH(N9,Agendas,0))),\"\"),\"\")","v":""},null,{"$f":"IF(ISNUMBER(P9),IFERROR(INDIRECT(CONCATENATE(Agenda,1+MATCH(P9,Agendas,0))),\"\"),\"\")","v":""}]
[]
[]
[]
[{"$f":"WEEKNUM(B15,1)","v":16},{"$f":"P9","v":"2010-04-11"},{"$f":"IF(ISNUMBER(B15),IFERROR(INDIRECT(CONCATENATE(Fiesta,2+MATCH(B15,Fiestas,0))),\"\"),\"\")","v":""},{"$f":"P9+1","v":"2010-04-12"},{"$f":"IF(ISNUMBER(D15),IFERROR(INDIRECT(CONCATENATE(Fiesta,2+MATCH(D15,Fiestas,0))),\"\"),\"\")","v":""},{"$f":"D15+1","v":"2010-04-13"},{"$f":"IF(ISNUMBER(F15),IFERROR(INDIRECT(CONCATENATE(Fiesta,2+MATCH(F15,Fiestas,0))),\"\"),\"\")","v":""},{"$f":"F15+1","v":"2010-04-14"},{"$f":"IF(ISNUMBER(H15),IFERROR(INDIRECT(CONCATENATE(Fiesta,2+MATCH(H15,Fiestas,0))),\"\"),\"\")","v":""},{"$f":"H15+1","v":"2010-04-15"},{"$f":"IF(ISNUMBER(J15),IFERROR(INDIRECT(CONCATENATE(Fiesta,2+MATCH(J15,Fiestas,0))),\"\"),\"\")","v":""},{"$f":"J15+1","v":"2010-04-16"},{"$f":"IF(ISNUMBER(L15),IFERROR(INDIRECT(CONCATENATE(Fiesta,2+MATCH(L15,Fiestas,0))),\"\"),\"\")","v":""},{"$f":"L15+1","v":"2010-04-17"},{"$f":"IF(ISNUMBER(N15),IFERROR(INDIRECT(CONCATENATE(Fiesta,2+MATCH(N15,Fiestas,0))),\"\"),\"\")","v":""},{"$f":"N15+1","v":"2010-04-18"},{"$f":"IF(ISNUMBER(P15),IFERROR(INDIRECT(CONCATENATE(Fiesta,2+MATCH(P15,Fiestas,0))),\"\"),\"\")","v":""},{"$f":"WEEKNUM(D15,2)","v":16}]
[null,{"$f":"IF(ISNUMBER(B15),IFERROR(INDIRECT(CONCATENATE(Evento,1+MATCH(B15,Eventos,0))),\"\"),\"\")","v":"World Parkinson’s Day"},null,{"$f":"IF(ISNUMBER(D15),IFERROR(INDIRECT(CONCATENATE(Evento,1+MATCH(D15,Eventos,0))),\"\"),\"\")","v":""},null,{"$f":"IF(ISNUMBER(F15),IFERROR(INDIRECT(CONCATENATE(Evento,1+MATCH(F15,Eventos,0))),\"\"),\"\")","v":""},null,{"$f":"IF(ISNUMBER(H15),IFERROR(INDIRECT(CONCATENATE(Evento,1+MATCH(H15,Eventos,0))),\"\"),\"\")","v":""},null,{"$f":"IF(ISNUMBER(J15),IFERROR(INDIRECT(CONCATENATE(Evento,1+MATCH(J15,Eventos,0))),\"\"),\"\")","v":""},null,{"$f":"IF(ISNUMBER(L15),IFERROR(INDIRECT(CONCATENATE(Evento,1+MATCH(L15,Eventos,0))),\"\"),\"\")","v":"World Voice Day"},null,{"$f":"IF(ISNUMBER(N15),IFERROR(INDIRECT(CONCATENATE(Evento,1+MATCH(N15,Eventos,0))),\"\"),\"\")","v":"World Haemophilia Day"},null,{"$f":"IF(ISNUMBER(P15),IFERROR(INDIRECT(CONCATENATE(Evento,1+MATCH(P15,Eventos,0))),\"\"),\"\")","v":""}]
[null,{"$f":"IF(ISNUMBER(B15),IFERROR(INDIRECT(CONCATENATE(Agenda,1+MATCH(B15,Agendas,0))),\"\"),\"\")","v":""},null,{"$f":"IF(ISNUMBER(D15),IFERROR(INDIRECT(CONCATENATE(Agenda,1+MATCH(D15,Agendas,0))),\"\"),\"\")","v":""},null,{"$f":"IF(ISNUMBER(F15),IFERROR(INDIRECT(CONCATENATE(Agenda,1+MATCH(F15,Agendas,0))),\"\"),\"\")","v":""},null,{"$f":"IF(ISNUMBER(H15),IFERROR(INDIRECT(CONCATENATE(Agenda,1+MATCH(H15,Agendas,0))),\"\"),\"\")","v":""},null,{"$f":"IF(ISNUMBER(J15),IFERROR(INDIRECT(CONCATENATE(Agenda,1+MATCH(J15,Agendas,0))),\"\"),\"\")","v":""},null,{"$f":"IF(ISNUMBER(L15),IFERROR(INDIRECT(CONCATENATE(Agenda,1+MATCH(L15,Agendas,0))),\"\"),\"\")","v":""},null,{"$f":"IF(ISNUMBER(N15),IFERROR(INDIRECT(CONCATENATE(Agenda,1+MATCH(N15,Agendas,0))),\"\"),\"\")","v":""},null,{"$f":"IF(ISNUMBER(P15),IFERROR(INDIRECT(CONCATENATE(Agenda,1+MATCH(P15,Agendas,0))),\"\"),\"\")","v":""}]
[]
[]
[]
[{"$f":"WEEKNUM(B21,1)","v":17},{"$f":"P15","v":"2010-04-18"},{"$f":"IF(ISNUMBER(B21),IFERROR(INDIRECT(CONCATENATE(Fiesta,2+MATCH(B21,Fiestas,0))),\"\"),\"\")","v":""},{"$f":"P15+1","v":"2010-04-19"},{"$f":"IF(ISNUMBER(D21),IFERROR(INDIRECT(CONCATENATE(Fiesta,2+MATCH(D21,Fiestas,0))),\"\"),\"\")","v":""},{"$f":"D21+1","v":"2010-04-20"},{"$f":"IF(ISNUMBER(F21),IFERROR(INDIRECT(CONCATENATE(Fiesta,2+MATCH(F21,Fiestas,0))),\"\"),\"\")","v":""},{"$f":"F21+1","v":"2010-04-21"},{"$f":"IF(ISNUMBER(H21),IFERROR(INDIRECT(CONCATENATE(Fiesta,2+MATCH(H21,Fiestas,0))),\"\"),\"\")","v":""},{"$f":"H21+1","v":"2010-04-22"},{"$f":"IF(ISNUMBER(J21),IFERROR(INDIRECT(CONCATENATE(Fiesta,2+MATCH(J21,Fiestas,0))),\"\"),\"\")","v":""},{"$f":"J21+1","v":"2010-04-23"},{"$f":"IF(ISNUMBER(L21),IFERROR(INDIRECT(CONCATENATE(Fiesta,2+MATCH(L21,Fiestas,0))),\"\"),\"\")","v":""},{"$f":"L21+1","v":"2010-04-24"},{"$f":"IF(ISNUMBER(N21),IFERROR(INDIRECT(CONCATENATE(Fiesta,2+MATCH(N21,Fiestas,0))),\"\"),\"\")","v":""},{"$f":"N21+1","v":"2010-04-25"},{"$f":"IF(ISNUMBER(P21),IFERROR(INDIRECT(CONCATENATE(Fiesta,2+MATCH(P21,Fiestas,0))),\"\"),\"\")","v":""},{"$f":"WEEKNUM(D21,2)","v":17}]
[null,{"$f":"IF(ISNUMBER(B21),IFERROR(INDIRECT(CONCATENATE(Evento,1+MATCH(B21,Eventos,0))),\"\"),\"\")","v":""},null,{"$f":"IF(ISNUMBER(D21),IFERROR(INDIRECT(CONCATENATE(Evento,1+MATCH(D21,Eventos,0))),\"\"),\"\")","v":""},null,{"$f":"IF(ISNUMBER(F21),IFERROR(INDIRECT(CONCATENATE(Evento,1+MATCH(F21,Eventos,0))),\"\"),\"\")","v":""},null,{"$f":"IF(ISNUMBER(H21),IFERROR(INDIRECT(CONCATENATE(Evento,1+MATCH(H21,Eventos,0))),\"\"),\"\")","v":""},null,{"$f":"IF(ISNUMBER(J21),IFERROR(INDIRECT(CONCATENATE(Evento,1+MATCH(J21,Eventos,0))),\"\"),\"\")","v":""},null,{"$f":"IF(ISNUMBER(L21),IFERROR(INDIRECT(CONCATENATE(Evento,1+MATCH(L21,Eventos,0))),\"\"),\"\")","v":"World Book and Copyright Day"},null,{"$f":"IF(ISNUMBER(N21),IFERROR(INDIRECT(CONCATENATE(Evento,1+MATCH(N21,Eventos,0))),\"\"),\"\")","v":""},null,{"$f":"IF(ISNUMBER(P21),IFERROR(INDIRECT(CONCATENATE(Evento,1+MATCH(P21,Eventos,0))),\"\"),\"\")","v":""}]
[null,{"$f":"IF(ISNUMBER(B21),IFERROR(INDIRECT(CONCATENATE(Agenda,1+MATCH(B21,Agendas,0))),\"\"),\"\")","v":""},null,{"$f":"IF(ISNUMBER(D21),IFERROR(INDIRECT(CONCATENATE(Agenda,1+MATCH(D21,Agendas,0))),\"\"),\"\")","v":""},null,{"$f":"IF(ISNUMBER(F21),IFERROR(INDIRECT(CONCATENATE(Agenda,1+MATCH(F21,Agendas,0))),\"\"),\"\")","v":""},null,{"$f":"IF(ISNUMBER(H21),IFERROR(INDIRECT(CONCATENATE(Agenda,1+MATCH(H21,Agendas,0))),\"\"),\"\")","v":""},null,{"$f":"IF(ISNUMBER(J21),IFERROR(INDIRECT(CONCATENATE(Agenda,1+MATCH(J21,Agendas,0))),\"\"),\"\")","v":""},null,{"$f":"IF(ISNUMBER(L21),IFERROR(INDIRECT(CONCATENATE(Agenda,1+MATCH(L21,Agendas,0))),\"\"),\"\")","v":""},null,{"$f":"IF(ISNUMBER(N21),IFERROR(INDIRECT(CONCATENATE(Agenda,1+MATCH(N21,Agendas,0))),\"\"),\"\")","v":""},null,{"$f":"IF(ISNUMBER(P21),IFERROR(INDIRECT(CONCATENATE(Agenda,1+MATCH(P21,Agendas,0))),\"\"),\"\")","v":""}]
[]
[]
[]
[{"$f":"IF(B27=\"\",\"\",WEEKNUM(B27,1))","v":18},{"$f":"P21","v":"2010-04-25"},{"$f":"IF(ISNUMBER(B27),IFERROR(INDIRECT(CONCATENATE(Fiesta,2+MATCH(B27,Fiestas,0))),\"\"),\"\")","v":""},{"$f":"IF(P21<EOMONTH($D$1,0),P21+1,\"\")","v":"2010-04-26"},{"$f":"IF(ISNUMBER(D27),IFERROR(INDIRECT(CONCATENATE(Fiesta,2+MATCH(D27,Fiestas,0))),\"\"),\"\")","v":""},{"$f":"IF(D27<EOMONTH($D$1,0),D27+1,\"\")","v":"2010-04-27"},{"$f":"IF(ISNUMBER(F27),IFERROR(INDIRECT(CONCATENATE(Fiesta,2+MATCH(F27,Fiestas,0))),\"\"),\"\")","v":""},{"$f":"IF(F27<EOMONTH($D$1,0),F27+1,\"\")","v":"2010-04-28"},{"$f":"IF(ISNUMBER(H27),IFERROR(INDIRECT(CONCATENATE(Fiesta,2+MATCH(H27,Fiestas,0))),\"\"),\"\")","v":""},{"$f":"IF(H27<EOMONTH($D$1,0),H27+1,\"\")","v":"2010-04-29"},{"$f":"IF(ISNUMBER(J27),IFERROR(INDIRECT(CONCATENATE(Fiesta,2+MATCH(J27,Fiestas,0))),\"\"),\"\")","v":""},{"$f":"IF(J27<EOMONTH($D$1,0),J27+1,\"\")","v":"2010-04-30"},{"$f":"IF(ISNUMBER(L27),IFERROR(INDIRECT(CONCATENATE(Fiesta,2+MATCH(L27,Fiestas,0))),\"\"),\"\")","v":""},{"$f":"IF(L27<EOMONTH($D$1,0),L27+1,\"\")","v":""},{"$f":"IF(ISNUMBER(N27),IFERROR(INDIRECT(CONCATENATE(Fiesta,2+MATCH(N27,Fiestas,0))),\"\"),\"\")","v":""},{"$f":"IF(N27<EOMONTH($D$1,0),N27+1,\"\")","v":""},{"$f":"IF(ISNUMBER(P27),IFERROR(INDIRECT(CONCATENATE(Fiesta,2+MATCH(P27,Fiestas,0))),\"\"),\"\")","v":""},{"$f":"IF(D27=\"\",\"\",WEEKNUM(D27,2))","v":18}]
[null,{"$f":"IF(ISNUMBER(B27),IFERROR(INDIRECT(CONCATENATE(Evento,1+MATCH(B27,Eventos,0))),\"\"),\"\")","v":""},null,{"$f":"IF(ISNUMBER(D27),IFERROR(INDIRECT(CONCATENATE(Evento,1+MATCH(D27,Eventos,0))),\"\"),\"\")","v":"World Intellectual Property Day"},null,{"$f":"IF(ISNUMBER(F27),IFERROR(INDIRECT(CONCATENATE(Evento,1+MATCH(F27,Eventos,0))),\"\"),\"\")","v":""},null,{"$f":"IF(ISNUMBER(H27),IFERROR(INDIRECT(CONCATENATE(Evento,1+MATCH(H27,Eventos,0))),\"\"),\"\")","v":""},null,{"$f":"IF(ISNUMBER(J27),IFERROR(INDIRECT(CONCATENATE(Evento,1+MATCH(J27,Eventos,0))),\"\"),\"\")","v":""},null,{"$f":"IF(ISNUMBER(L27),IFERROR(INDIRECT(CONCATENATE(Evento,1+MATCH(L27,Eventos,0))),\"\"),\"\")","v":""},null,{"$f":"IF(ISNUMBER(N27),IFERROR(INDIRECT(CONCATENATE(Evento,1+MATCH(N27,Eventos,0))),\"\"),\"\")","v":""},null,{"$f":"IF(ISNUMBER(P27),IFERROR(INDIRECT(CONCATENATE(Evento,1+MATCH(P27,Eventos,0))),\"\"),\"\")","v":""}]
[null,{"$f":"IF(ISNUMBER(B27),IFERROR(INDIRECT(CONCATENATE(Agenda,1+MATCH(B27,Agendas,0))),\"\"),\"\")","v":""},null,{"$f":"IF(ISNUMBER(D27),IFERROR(INDIRECT(CONCATENATE(Agenda,1+MATCH(D27,Agendas,0))),\"\"),\"\")","v":""},null,{"$f":"IF(ISNUMBER(F27),IFERROR(INDIRECT(CONCATENATE(Agenda,1+MATCH(F27,Agendas,0))),\"\"),\"\")","v":""},null,{"$f":"IF(ISNUMBER(H27),IFERROR(INDIRECT(CONCATENATE(Agenda,1+MATCH(H27,Agendas,0))),\"\"),\"\")","v":""},null,{"$f":"IF(ISNUMBER(J27),IFERROR(INDIRECT(CONCATENATE(Agenda,1+MATCH(J27,Agendas,0))),\"\"),\"\")","v":""},null,{"$f":"IF(ISNUMBER(L27),IFERROR(INDIRECT(CONCATENATE(Agenda,1+MATCH(L27,Agendas,0))),\"\"),\"\")","v":""},null,{"$f":"IF(ISNUMBER(N27),IFERROR(INDIRECT(CONCATENATE(Agenda,1+MATCH(N27,Agendas,0))),\"\"),\"\")","v":""},null,{"$f":"IF(ISNUMBER(P27),IFERROR(INDIRECT(CONCATENATE(Agenda,1+MATCH(P27,Agendas,0))),\"\"),\"\")","v":""}]
[]
[]
[]
[{"$f":"IF(B33=\"\",\"\",WEEKNUM(B33,1))","v":""},{"$f":"P27","v":""},{"$f":"IF(ISNUMBER(B33),IFERROR(INDIRECT(CONCATENATE(Fiesta,2+MATCH(B33,Fiestas,0))),\"\"),\"\")","v":""},{"$f":"IF(P27<EOMONTH($D$1,0),P27+1,\"\")","v":""},{"$f":"IF(ISNUMBER(D33),IFERROR(INDIRECT(CONCATENATE(Fiesta,2+MATCH(D33,Fiestas,0))),\"\"),\"\")","v":""},{"$f":"IF(D33<EOMONTH($D$1,0),D33+1,\"\")","v":""},{"$f":"IF(ISNUMBER(F33),IFERROR(INDIRECT(CONCATENATE(Fiesta,2+MATCH(F33,Fiestas,0))),\"\"),\"\")","v":""},"Notes:",null,null,null,null,null,null,null,null,null,{"$f":"IF(D33=\"\",\"\",WEEKNUM(D33,2))","v":""}]
[null,{"$f":"IF(ISNUMBER(B33),IFERROR(INDIRECT(CONCATENATE(Evento,1+MATCH(B33,Eventos,0))),\"\"),\"\")","v":""},null,{"$f":"IF(ISNUMBER(D33),IFERROR(INDIRECT(CONCATENATE(Evento,1+MATCH(D33,Eventos,0))),\"\"),\"\")","v":""},null,{"$f":"IF(ISNUMBER(F33),IFERROR(INDIRECT(CONCATENATE(Evento,1+MATCH(F33,Eventos,0))),\"\"),\"\")","v":""}]
[null,{"$f":"IF(ISNUMBER(B33),IFERROR(INDIRECT(CONCATENATE(Agenda,1+MATCH(B33,Agendas,0))),\"\"),\"\")","v":""},null,{"$f":"IF(ISNUMBER(D33),IFERROR(INDIRECT(CONCATENATE(Agenda,1+MATCH(D33,Agendas,0))),\"\"),\"\")","v":""},null,{"$f":"IF(ISNUMBER(F33),IFERROR(INDIRECT(CONCATENATE(Agenda,1+MATCH(F33,Agendas,0))),\"\"),\"\")","v":""}]

{"sheet":"May","index":8,"n_rows":35,"n_cols":18,"rows_kept":35,"cut":false,"hidden":false,"merged":[[36,7,36,8],[36,9,36,10],[36,11,36,12],[37,7,37,8],[37,9,37,10],[37,11,37,12],[36,13,36,16],[37,13,37,16],[34,7,34,8],[34,9,34,10],[34,11,34,12],[34,13,34,14],[34,15,34,16],[35,7,35,8],[35,9,35,10],[35,11,35,12],[35,13,35,14],[35,15,35,16],[37,1,37,2],[37,3,37,4],[37,5,37,6],[36,1,36,2],[36,3,36,4],[36,5,36,6],[35,1,35,2],[35,3,35,4],[35,5,35,6],[34,1,34,2],[34,3,34,4],[34,5,34,6],[31,11,31,12],[31,13,31,14],[31,15,31,16],[33,1,33,2],[33,3,33,4],[33,5,33,6],[31,1,31,2],[31,3,31,4],[31,5,31,6],[31,7,31,8],[31,9,31,10],[32,7,32,8],[32,9,32,10],[32,11,32,12],[32,13,32,14],[32,15,32,16],[33,7,33,8],[33,9,33,10],[33,11,33,12],[33,13,33,14],[33,15,33,16],[29,11,29,12],[29,13,29,14],[29,15,29,16],[30,1,30,2],[30,3,30,4],[30,5,30,6],[30,7,30,8],[30,9,30,10],[30,11,30,12],[30,13,30,14],[30,15,30,16],[29,1,29,2],[29,3,29,4],[29,5,29,6],[29,7,29,8],[29,9,29,10],[27,11,27,12],[27,13,27,14],[27,15,27,16],[28,1,28,2],[28,3,28,4],[28,5,28,6],[28,7,28,8],[28,9,28,10],[28,11,28,12],[28,13,28,14],[28,15,28,16],[27,1,27,2],[27,3,27,4],[27,5,27,6],[27,7,27,8],[27,9,27,10],[24,11,24,12],[24,13,24,14],[24,15,24,16],[25,1,25,2],[25,3,25,4],[25,5,25,6],[25,7,25,8],[25,9,25,10],[25,11,25,12],[25,13,25,14],[25,15,25,16],[24,1,24,2],[24,3,24,4],[24,5,24,6],[24,7,24,8],[24,9,24,10],[22,11,22,12],[22,13,22,14],[22,15,22,16],[23,1,23,2],[23,3,23,4],[23,5,23,6],[23,7,23,8],[23,9,23,10],[23,11,23,12],[23,13,23,14],[23,15,23,16],[22,1,22,2],[22,3,22,4],[22,5,22,6],[22,7,22,8],[22,9,22,10],[19,11,19,12],[19,13,19,14],[19,15,19,16],[21,1,21,2],[21,3,21,4],[21,5,21,6],[21,7,21,8],[21,9,21,10],[21,11,21,12],[21,13,21,14],[21,15,21,16],[19,1,19,2],[19,3,19,4],[19,5,19,6],[19,7,19,8],[19,9,19,10],[17,11,17,12],[17,13,17,14],[17,15,17,16],[18,1,18,2],[18,3,18,4],[18,5,18,6],[18,7,18,8],[18,9,18,10],[18,11,18,12],[18,13,18,14],[18,15,18,16],[17,1,17,2],[17,3,17,4],[17,5,17,6],[17,7,17,8],[17,9,17,10],[15,11,15,12],[15,13,15,14],[15,15,15,16],[16,1,16,2],[16,3,16,4],[16,5,16,6],[16,7,16,8],[16,9,16,10],[16,11,16,12],[16,13,16,14],[16,15,16,16],[15,1,15,2],[15,3,15,4],[15,5,15,6],[15,7,15,8],[15,9,15,10],[12,11,12,12],[12,13,12,14],[12,15,12,16],[13,1,13,2],[13,3,13,4],[13,5,13,6],[13,7,13,8],[13,9,13,10],[13,11,13,12],[13,13,13,14],[13,15,13,16],[12,1,12,2],[12,3,12,4],[12,5,12,6],[12,7,12,8],[12,9,12,10],[10,11,10,12],[10,13,10,14],[10,15,10,16],[11,1,11,2],[11,3,11,4],[11,5,11,6],[11,7,11,8],[11,9,11,10],[11,11,11,12],[11,13,11,14],[11,15,11,16],[10,1,10,2],[10,3,10,4],[10,5,10,6],[10,7,10,8],[10,9,10,10],[7,11,7,12],[7,13,7,14],[7,15,7,16],[9,1,9,2],[9,3,9,4],[9,5,9,6],[9,7,9,8],[9,9,9,10],[9,11,9,12],[9,13,9,14],[9,15,9,16],[7,1,7,2],[7,3,7,4],[7,5,7,6],[7,7,7,8],[7,9,7,10],[6,1,6,2],[6,3,6,4],[6,5,6,6],[6,7,6,8],[6,9,6,10],[6,11,6,12],[6,13,6,14],[6,15,6,16],[5,1,5,2],[5,3,5,4],[5,5,5,6],[5,7,5,8],[5,9,5,10],[4,11,4,12],[4,13,4,14],[4,15,4,16],[3,1,3,2],[3,3,3,4],[3,5,3,6],[3,7,3,8],[3,9,3,10],[5,11,5,12],[5,13,5,14],[5,15,5,16],[3,11,3,12],[3,13,3,14],[3,15,3,16],[4,1,4,2],[4,3,4,4],[4,5,4,6],[4,7,4,8],[4,9,4,10],[0,9,0,11],[1,15,1,16],[1,1,1,2],[1,3,1,4],[1,5,1,6],[1,7,1,8],[1,9,1,10],[1,11,1,12],[1,13,1,14],[0,3,0,8]]}
[null,null,null,{"$f":"DATE(Cal!M3,5,1)","v":"2010-05-01"},null,null,null,null,null,{"$f":"Cal!$M$3","v":2010}]
[null,{"$f":"DATE(2010,2,7)","v":"2010-02-07"},null,{"$f":"DATE(2010,2,1)","v":"2010-02-01"},null,{"$f":"DATE(2010,2,2)","v":"2010-02-02"},null,{"$f":"DATE(2010,2,3)","v":"2010-02-03"},null,{"$f":"DATE(2010,2,4)","v":"2010-02-04"},null,{"$f":"DATE(2010,2,5)","v":"2010-02-05"},null,{"$f":"DATE(2010,2,6)","v":"2010-02-06"},null,{"$f":"DATE(2010,2,7)","v":"2010-02-07"}]
[{"$f":"IF(N3=\"\",\"\",WEEKNUM(N3,1))","v":18},null,{"$f":"IF(ISNUMBER(B3),IFERROR(INDIRECT(CONCATENATE(Fiesta,2+MATCH(B3,Fiestas,0))),\"\"),\"\")","v":""},{"$f":"IF(WEEKDAY($D$1)=2,$D$1,\"\")","v":""},{"$f":"IF(ISNUMBER(D3),IFERROR(INDIRECT(CONCATENATE(Fiesta,2+MATCH(D3,Fiestas,0))),\"\"),\"\")","v":""},{"$f":"IF(D3<>\"\",D3+1,IF(WEEKDAY($D$1)=3,$D$1,\"\"))","v":""},{"$f":"IF(ISNUMBER(F3),IFERROR(INDIRECT(CONCATENATE(Fiesta,2+MATCH(F3,Fiestas,0))),\"\"),\"\")","v":""},{"$f":"IF(F3<>\"\",F3+1,IF(WEEKDAY($D$1)=4,$D$1,\"\"))","v":""},{"$f":"IF(ISNUMBER(H3),IFERROR(INDIRECT(CONCATENATE(Fiesta,2+MATCH(H3,Fiestas,0))),\"\"),\"\")","v":""},{"$f":"IF(H3<>\"\",H3+1,IF(WEEKDAY($D$1)=5,$D$1,\"\"))","v":""},{"$f":"IF(ISNUMBER(J3),IFERROR(INDIRECT(CONCATENATE(Fiesta,2+MATCH(J3,Fiestas,0))),\"\"),\"\")","v":""},{"$f":"IF(J3<>\"\",J3+1,IF(WEEKDAY($D$1)=6,$D$1,\"\"))","v":""},{"$f":"IF(ISNUMBER(L3),IFERROR(INDIRECT(CONCATENATE(Fiesta,2+MATCH(L3,Fiestas,0))),\"\"),\"\")","v":""},{"$f":"IF(L3<>\"\",L3+1,IF(WEEKDAY($D$1)=7,$D$1,\"\"))","v":"2010-05-01"},{"$f":"IF(ISNUMBER(N3),IFERROR(INDIRECT(CONCATENATE(Fiesta,2+MATCH(N3,Fiestas,0))),\"\"),\"\")","v":""},{"$f":"IF(N3<>\"\",N3+1,IF(WEEKDAY($D$1)=1,$D$1,\"\"))","v":"2010-05-02"},{"$f":"IF(ISNUMBER(P3),IFERROR(INDIRECT(CONCATENATE(Fiesta,2+MATCH(P3,Fiestas,0))),\"\"),\"\")","v":""},{"$f":"IF(P3=\"\",\"\",WEEKNUM(P3,2))","v":18}]
[null,{"$f":"IF(ISNUMBER(B3),IFERROR(INDIRECT(CONCATENATE(Evento,1+MATCH(B3,Eventos,0))),\"\"),\"\")","v":""},null,{"$f":"IF(ISNUMBER(D3),IFERROR(INDIRECT(CONCATENATE(Evento,1+MATCH(D3,Eventos,0))),\"\"),\"\")","v":""},null,{"$f":"IF(ISNUMBER(F3),IFERROR(INDIRECT(CONCATENATE(Evento,1+MATCH(F3,Eventos,0))),\"\"),\"\")","v":""},null,{"$f":"IF(ISNUMBER(H3),IFERROR(INDIRECT(CONCATENATE(Evento,1+MATCH(H3,Eventos,0))),\"\"),\"\")","v":""},null,{"$f":"IF(ISNUMBER(J3),IFERROR(INDIRECT(CONCATENATE(Evento,1+MATCH(J3,Eventos,0))),\"\"),\"\")","v":""},null,{"$f":"IF(ISNUMBER(L3),IFERROR(INDIRECT(CONCATENATE(Evento,1+MATCH(L3,Eventos,0))),\"\"),\"\")","v":""},null,{"$f":"IF(ISNUMBER(N3),IFERROR(INDIRECT(CONCATENATE(Evento,1+MATCH(N3,Eventos,0))),\"\"),\"\")","v":"May Day - Labour Day"},null,{"$f":"IF(ISNUMBER(P3),IFERROR(INDIRECT(CONCATENATE(Evento,1+MATCH(P3,Eventos,0))),\"\"),\"\")","v":""}]
[null,{"$f":"IF(ISNUMBER(B3),IFERROR(INDIRECT(CONCATENATE(Agenda,1+MATCH(B3,Agendas,0))),\"\"),\"\")","v":""},null,{"$f":"IF(ISNUMBER(D3),IFERROR(INDIRECT(CONCATENATE(Agenda,1+MATCH(D3,Agendas,0))),\"\"),\"\")","v":""},null,{"$f":"IF(ISNUMBER(F3),IFERROR(INDIRECT(CONCATENATE(Agenda,1+MATCH(F3,Agendas,0))),\"\"),\"\")","v":""},null,{"$f":"IF(ISNUMBER(H3),IFERROR(INDIRECT(CONCATENATE(Agenda,1+MATCH(H3,Agendas,0))),\"\"),\"\")","v":""},null,{"$f":"IF(ISNUMBER(J3),IFERROR(INDIRECT(CONCATENATE(Agenda,1+MATCH(J3,Agendas,0))),\"\"),\"\")","v":""},null,{"$f":"IF(ISNUMBER(L3),IFERROR(INDIRECT(CONCATENATE(Agenda,1+MATCH(L3,Agendas,0))),\"\"),\"\")","v":""},null,{"$f":"IF(ISNUMBER(N3),IFERROR(INDIRECT(CONCATENATE(Agenda,1+MATCH(N3,Agendas,0))),\"\"),\"\")","v":""},null,{"$f":"IF(ISNUMBER(P3),IFERROR(INDIRECT(CONCATENATE(Agenda,1+MATCH(P3,Agendas,0))),\"\"),\"\")","v":""}]
[]
[]
[]
[{"$f":"WEEKNUM(B9,1)","v":19},{"$f":"P3","v":"2010-05-02"},{"$f":"IF(ISNUMBER(B9),IFERROR(INDIRECT(CONCATENATE(Fiesta,2+MATCH(B9,Fiestas,0))),\"\"),\"\")","v":""},{"$f":"P3+1","v":"2010-05-03"},{"$f":"IF(ISNUMBER(D9),IFERROR(INDIRECT(CONCATENATE(Fiesta,2+MATCH(D9,Fiestas,0))),\"\"),\"\")","v":""},{"$f":"D9+1","v":"2010-05-04"},{"$f":"IF(ISNUMBER(F9),IFERROR(INDIRECT(CONCATENATE(Fiesta,2+MATCH(F9,Fiestas,0))),\"\"),\"\")","v":""},{"$f":"F9+1","v":"2010-05-05"},{"$f":"IF(ISNUMBER(H9),IFERROR(INDIRECT(CONCATENATE(Fiesta,2+MATCH(H9,Fiestas,0))),\"\"),\"\")","v":""},{"$f":"H9+1","v":"2010-05-06"},{"$f":"IF(ISNUMBER(J9),IFERROR(INDIRECT(CONCATENATE(Fiesta,2+MATCH(J9,Fiestas,0))),\"\"),\"\")","v":""},{"$f":"J9+1","v":"2010-05-07"},{"$f":"IF(ISNUMBER(L9),IFERROR(INDIRECT(CONCATENATE(Fiesta,2+MATCH(L9,Fiestas,0))),\"\"),\"\")","v":""},{"$f":"L9+1","v":"2010-05-08"},{"$f":"IF(ISNUMBER(N9),IFERROR(INDIRECT(CONCATENATE(Fiesta,2+MATCH(N9,Fiestas,0))),\"\"),\"\")","v":""},{"$f":"N9+1","v":"2010-05-09"},{"$f":"IF(ISNUMBER(P9),IFERROR(INDIRECT(CONCATENATE(Fiesta,2+MATCH(P9,Fiestas,0))),\"\"),\"\")","v":""},{"$f":"WEEKNUM(D9,2)","v":19}]
[null,{"$f":"IF(ISNUMBER(B9),IFERROR(INDIRECT(CONCATENATE(Evento,1+MATCH(B9,Eventos,0))),\"\"),\"\")","v":""},null,{"$f":"IF(ISNUMBER(D9),IFERROR(INDIRECT(CONCATENATE(Evento,1+MATCH(D9,Eventos,0))),\"\"),\"\")","v":"World Press Freedom Day"},null,{"$f":"IF(ISNUMBER(F9),IFERROR(INDIRECT(CONCATENATE(Evento,1+MATCH(F9,Eventos,0))),\"\"),\"\")","v":""},null,{"$f":"IF(ISNUMBER(H9),IFERROR(INDIRECT(CONCATENATE(Evento,1+MATCH(H9,Eventos,0))),\"\"),\"\")","v":""},null,{"$f":"IF(ISNUMBER(J9),IFERROR(INDIRECT(CONCATENATE(Evento,1+MATCH(J9,Eventos,0))),\"\"),\"\")","v":""},null,{"$f":"IF(ISNUMBER(L9),IFERROR(INDIRECT(CONCATENATE(Evento,1+MATCH(L9,Eventos,0))),\"\"),\"\")","v":""},null,{"$f":"IF(ISNUMBER(N9),IFERROR(INDIRECT(CONCATENATE(Evento,1+MATCH(N9,Eventos,0))),\"\"),\"\")","v":""},null,{"$f":"IF(ISNUMBER(P9),IFERROR(INDIRECT(CONCATENATE(Evento,1+MATCH(P9,Eventos,0))),\"\"),\"\")","v":""}]
[null,{"$f":"IF(ISNUMBER(B9),IFERROR(INDIRECT(CONCATENATE(Agenda,1+MATCH(B9,Agendas,0))),\"\"),\"\")","v":""},null,{"$f":"IF(ISNUMBER(D9),IFERROR(INDIRECT(CONCATENATE(Agenda,1+MATCH(D9,Agendas,0))),\"\"),\"\")","v":""},null,{"$f":"IF(ISNUMBER(F9),IFERROR(INDIRECT(CONCATENATE(Agenda,1+MATCH(F9,Agendas,0))),\"\"),\"\")","v":""},null,{"$f":"IF(ISNUMBER(H9),IFERROR(INDIRECT(CONCATENATE(Agenda,1+MATCH(H9,Agendas,0))),\"\"),\"\")","v":""},null,{"$f":"IF(ISNUMBER(J9),IFERROR(INDIRECT(CONCATENATE(Agenda,1+MATCH(J9,Agendas,0))),\"\"),\"\")","v":""},null,{"$f":"IF(ISNUMBER(L9),IFERROR(INDIRECT(CONCATENATE(Agenda,1+MATCH(L9,Agendas,0))),\"\"),\"\")","v":""},null,{"$f":"IF(ISNUMBER(N9),IFERROR(INDIRECT(CONCATENATE(Agenda,1+MATCH(N9,Agendas,0))),\"\"),\"\")","v":""},null,{"$f":"IF(ISNUMBER(P9),IFERROR(INDIRECT(CONCATENATE(Agenda,1+MATCH(P9,Agendas,0))),\"\"),\"\")","v":""}]
[]
[]
[]
[{"$f":"WEEKNUM(B15,1)","v":20},{"$f":"P9","v":"2010-05-09"},{"$f":"IF(ISNUMBER(B15),IFERROR(INDIRECT(CONCATENATE(Fiesta,2+MATCH(B15,Fiestas,0))),\"\"),\"\")","v":""},{"$f":"P9+1","v":"2010-05-10"},{"$f":"IF(ISNUMBER(D15),IFERROR(INDIRECT(CONCATENATE(Fiesta,2+MATCH(D15,Fiestas,0))),\"\"),\"\")","v":""},{"$f":"D15+1","v":"2010-05-11"},{"$f":"IF(ISNUMBER(F15),IFERROR(INDIRECT(CONCATENATE(Fiesta,2+MATCH(F15,Fiestas,0))),\"\"),\"\")","v":""},{"$f":"F15+1","v":"2010-05-12"},{"$f":"IF(ISNUMBER(H15),IFERROR(INDIRECT(CONCATENATE(Fiesta,2+MATCH(H15,Fiestas,0))),\"\"),\"\")","v":""},{"$f":"H15+1","v":"2010-05-13"},{"$f":"IF(ISNUMBER(J15),IFERROR(INDIRECT(CONCATENATE(Fiesta,2+MATCH(J15,Fiestas,0))),\"\"),\"\")","v":""},{"$f":"J15+1","v":"2010-05-14"},{"$f":"IF(ISNUMBER(L15),IFERROR(INDIRECT(CONCATENATE(Fiesta,2+MATCH(L15,Fiestas,0))),\"\"),\"\")","v":""},{"$f":"L15+1","v":"2010-05-15"},{"$f":"IF(ISNUMBER(N15),IFERROR(INDIRECT(CONCATENATE(Fiesta,2+MATCH(N15,Fiestas,0))),\"\"),\"\")","v":""},{"$f":"N15+1","v":"2010-05-16"},{"$f":"IF(ISNUMBER(P15),IFERROR(INDIRECT(CONCATENATE(Fiesta,2+MATCH(P15,Fiestas,0))),\"\"),\"\")","v":""},{"$f":"WEEKNUM(D15,2)","v":20}]
[null,{"$f":"IF(ISNUMBER(B15),IFERROR(INDIRECT(CONCATENATE(Evento,1+MATCH(B15,Eventos,0))),\"\"),\"\")","v":""},null,{"$f":"IF(ISNUMBER(D15),IFERROR(INDIRECT(CONCATENATE(Evento,1+MATCH(D15,Eventos,0))),\"\"),\"\")","v":"World Lupus Day"},null,{"$f":"IF(ISNUMBER(F15),IFERROR(INDIRECT(CONCATENATE(Evento,1+MATCH(F15,Eventos,0))),\"\"),\"\")","v":""},null,{"$f":"IF(ISNUMBER(H15),IFERROR(INDIRECT(CONCATENATE(Evento,1+MATCH(H15,Eventos,0))),\"\"),\"\")","v":"World Fibromyalgia and Chronic Fatigue Syndrome Day"},null,{"$f":"IF(ISNUMBER(J15),IFERROR(INDIRECT(CONCATENATE(Evento,1+MATCH(J15,Eventos,0))),\"\"),\"\")","v":""},null,{"$f":"IF(ISNUMBER(L15),IFERROR(INDIRECT(CONCATENATE(Evento,1+MATCH(L15,Eventos,0))),\"\"),\"\")","v":"World Hypertension Day"},null,{"$f":"IF(ISNUMBER(N15),IFERROR(INDIRECT(CONCATENATE(Evento,1+MATCH(N15,Eventos,0))),\"\"),\"\")","v":"International Day of Families"},null,{"$f":"IF(ISNUMBER(P15),IFERROR(INDIRECT(CONCATENATE(Evento,1+MATCH(P15,Eventos,0))),\"\"),\"\")","v":""}]
[null,{"$f":"IF(ISNUMBER(B15),IFERROR(INDIRECT(CONCATENATE(Agenda,1+MATCH(B15,Agendas,0))),\"\"),\"\")","v":""},null,{"$f":"IF(ISNUMBER(D15),IFERROR(INDIRECT(CONCATENATE(Agenda,1+MATCH(D15,Agendas,0))),\"\"),\"\")","v":""},null,{"$f":"IF(ISNUMBER(F15),IFERROR(INDIRECT(CONCATENATE(Agenda,1+MATCH(F15,Agendas,0))),\"\"),\"\")","v":""},null,{"$f":"IF(ISNUMBER(H15),IFERROR(INDIRECT(CONCATENATE(Agenda,1+MATCH(H15,Agendas,0))),\"\"),\"\")","v":""},null,{"$f":"IF(ISNUMBER(J15),IFERROR(INDIRECT(CONCATENATE(Agenda,1+MATCH(J15,Agendas,0))),\"\"),\"\")","v":""},null,{"$f":"IF(ISNUMBER(L15),IFERROR(INDIRECT(CONCATENATE(Agenda,1+MATCH(L15,Agendas,0))),\"\"),\"\")","v":""},null,{"$f":"IF(ISNUMBER(N15),IFERROR(INDIRECT(CONCATENATE(Agenda,1+MATCH(N15,Agendas,0))),\"\"),\"\")","v":""},null,{"$f":"IF(ISNUMBER(P15),IFERROR(INDIRECT(CONCATENATE(Agenda,1+MATCH(P15,Agendas,0))),\"\"),\"\")","v":""}]
[]
[]
[]
[{"$f":"WEEKNUM(B21,1)","v":21},{"$f":"P15","v":"2010-05-16"},{"$f":"IF(ISNUMBER(B21),IFERROR(INDIRECT(CONCATENATE(Fiesta,2+MATCH(B21,Fiestas,0))),\"\"),\"\")","v":""},{"$f":"P15+1","v":"2010-05-17"},{"$f":"IF(ISNUMBER(D21),IFERROR(INDIRECT(CONCATENATE(Fiesta,2+MATCH(D21,Fiestas,0))),\"\"),\"\")","v":""},{"$f":"D21+1","v":"2010-05-18"},{"$f":"IF(ISNUMBER(F21),IFERROR(INDIRECT(CONCATENATE(Fiesta,2+MATCH(F21,Fiestas,0))),\"\"),\"\")","v":""},{"$f":"F21+1","v":"2010-05-19"},{"$f":"IF(ISNUMBER(H21),IFERROR(INDIRECT(CONCATENATE(Fiesta,2+MATCH(H21,Fiestas,0))),\"\"),\"\")","v":""},{"$f":"H21+1","v":"2010-05-20"},{"$f":"IF(ISNUMBER(J21),IFERROR(INDIRECT(CONCATENATE(Fiesta,2+MATCH(J21,Fiestas,0))),\"\"),\"\")","v":""},{"$f":"J21+1","v":"2010-05-21"},{"$f":"IF(ISNUMBER(L21),IFERROR(INDIRECT(CONCATENATE(Fiesta,2+MATCH(L21,Fiestas,0))),\"\"),\"\")","v":""},{"$f":"L21+1","v":"2010-05-22"},{"$f":"IF(ISNUMBER(N21),IFERROR(INDIRECT(CONCATENATE(Fiesta,2+MATCH(N21,Fiestas,0))),\"\"),\"\")","v":""},{"$f":"N21+1","v":"2010-05-23"},{"$f":"IF(ISNUMBER(P21),IFERROR(INDIRECT(CONCATENATE(Fiesta,2+MATCH(P21,Fiestas,0))),\"\"),\"\")","v":""},{"$f":"WEEKNUM(D21,2)","v":21}]
[null,{"$f":"IF(ISNUMBER(B21),IFERROR(INDIRECT(CONCATENATE(Evento,1+MATCH(B21,Eventos,0))),\"\"),\"\")","v":""},null,{"$f":"IF(ISNUMBER(D21),IFERROR(INDIRECT(CONCATENATE(Evento,1+MATCH(D21,Eventos,0))),\"\"),\"\")","v":"World Information Society Day"},null,{"$f":"IF(ISNUMBER(F21),IFERROR(INDIRECT(CONCATENATE(Evento,1+MATCH(F21,Eventos,0))),\"\"),\"\")","v":""},null,{"$f":"IF(ISNUMBER(H21),IFERROR(INDIRECT(CONCATENATE(Evento,1+MATCH(H21,Eventos,0))),\"\"),\"\")","v":"World Hepatitis Day"},null,{"$f":"IF(ISNUMBER(J21),IFERROR(INDIRECT(CONCATENATE(Evento,1+MATCH(J21,Eventos,0))),\"\"),\"\")","v":""},null,{"$f":"IF(ISNUMBER(L21),IFERROR(INDIRECT(CONCATENATE(Evento,1+MATCH(L21,Eventos,0))),\"\"),\"\")","v":""},null,{"$f":"IF(ISNUMBER(N21),IFERROR(INDIRECT(CONCATENATE(Evento,1+MATCH(N21,Eventos,0))),\"\"),\"\")","v":""},null,{"$f":"IF(ISNUMBER(P21),IFERROR(INDIRECT(CONCATENATE(Evento,1+MATCH(P21,Eventos,0))),\"\"),\"\")","v":""}]
[null,{"$f":"IF(ISNUMBER(B21),IFERROR(INDIRECT(CONCATENATE(Agenda,1+MATCH(B21,Agendas,0))),\"\"),\"\")","v":""},null,{"$f":"IF(ISNUMBER(D21),IFERROR(INDIRECT(CONCATENATE(Agenda,1+MATCH(D21,Agendas,0))),\"\"),\"\")","v":""},null,{"$f":"IF(ISNUMBER(F21),IFERROR(INDIRECT(CONCATENATE(Agenda,1+MATCH(F21,Agendas,0))),\"\"),\"\")","v":""},null,{"$f":"IF(ISNUMBER(H21),IFERROR(INDIRECT(CONCATENATE(Agenda,1+MATCH(H21,Agendas,0))),\"\"),\"\")","v":""},null,{"$f":"IF(ISNUMBER(J21),IFERROR(INDIRECT(CONCATENATE(Agenda,1+MATCH(J21,Agendas,0))),\"\"),\"\")","v":""},null,{"$f":"IF(ISNUMBER(L21),IFERROR(INDIRECT(CONCATENATE(Agenda,1+MATCH(L21,Agendas,0))),\"\"),\"\")","v":""},null,{"$f":"IF(ISNUMBER(N21),IFERROR(INDIRECT(CONCATENATE(Agenda,1+MATCH(N21,Agendas,0))),\"\"),\"\")","v":""},null,{"$f":"IF(ISNUMBER(P21),IFERROR(INDIRECT(CONCATENATE(Agenda,1+MATCH(P21,Agendas,0))),\"\"),\"\")","v":""}]
[]
[]
[]
[{"$f":"IF(B27=\"\",\"\",WEEKNUM(B27,1))","v":22},{"$f":"P21","v":"2010-05-23"},{"$f":"IF(ISNUMBER(B27),IFERROR(INDIRECT(CONCATENATE(Fiesta,2+MATCH(B27,Fiestas,0))),\"\"),\"\")","v":""},{"$f":"IF(P21<EOMONTH($D$1,0),P21+1,\"\")","v":"2010-05-24"},{"$f":"IF(ISNUMBER(D27),IFERROR(INDIRECT(CONCATENATE(Fiesta,2+MATCH(D27,Fiestas,0))),\"\"),\"\")","v":""},{"$f":"IF(D27<EOMONTH($D$1,0),D27+1,\"\")","v":"2010-05-25"},{"$f":"IF(ISNUMBER(F27),IFERROR(INDIRECT(CONCATENATE(Fiesta,2+MATCH(F27,Fiestas,0))),\"\"),\"\")","v":""},{"$f":"IF(F27<EOMONTH($D$1,0),F27+1,\"\")","v":"2010-05-26"},{"$f":"IF(ISNUMBER(H27),IFERROR(INDIRECT(CONCATENATE(Fiesta,2+MATCH(H27,Fiestas,0))),\"\"),\"\")","v":""},{"$f":"IF(H27<EOMONTH($D$1,0),H27+1,\"\")","v":"2010-05-27"},{"$f":"IF(ISNUMBER(J27),IFERROR(INDIRECT(CONCATENATE(Fiesta,2+MATCH(J27,Fiestas,0))),\"\"),\"\")","v":""},{"$f":"IF(J27<EOMONTH($D$1,0),J27+1,\"\")","v":"2010-05-28"},{"$f":"IF(ISNUMBER(L27),IFERROR(INDIRECT(CONCATENATE(Fiesta,2+MATCH(L27,Fiestas,0))),\"\"),\"\")","v":""},{"$f":"IF(L27<EOMONTH($D$1,0),L27+1,\"\")","v":"2010-05-29"},{"$f":"IF(ISNUMBER(N27),IFERROR(INDIRECT(CONCATENATE(Fiesta,2+MATCH(N27,Fiestas,0))),\"\"),\"\")","v":""},{"$f":"IF(N27<EOMONTH($D$1,0),N27+1,\"\")","v":"2010-05-30"},{"$f":"IF(ISNUMBER(P27),IFERROR(INDIRECT(CONCATENATE(Fiesta,2+MATCH(P27,Fiestas,0))),\"\"),\"\")","v":""},{"$f":"IF(D27=\"\",\"\",WEEKNUM(D27,2))","v":22}]
[null,{"$f":"IF(ISNUMBER(B27),IFERROR(INDIRECT(CONCATENATE(Evento,1+MATCH(B27,Eventos,0))),\"\"),\"\")","v":""},null,{"$f":"IF(ISNUMBER(D27),IFERROR(INDIRECT(CONCATENATE(Evento,1+MATCH(D27,Eventos,0))),\"\"),\"\")","v":""},null,{"$f":"IF(ISNUMBER(F27),IFERROR(INDIRECT(CONCATENATE(Evento,1+MATCH(F27,Eventos,0))),\"\"),\"\")","v":""},null,{"$f":"IF(ISNUMBER(H27),IFERROR(INDIRECT(CONCATENATE(Evento,1+MATCH(H27,Eventos,0))),\"\"),\"\")","v":""},null,{"$f":"IF(ISNUMBER(J27),IFERROR(INDIRECT(CONCATENATE(Evento,1+MATCH(J27,Eventos,0))),\"\"),\"\")","v":""},null,{"$f":"IF(ISNUMBER(L27),IFERROR(INDIRECT(CONCATENATE(Evento,1+MATCH(L27,Eventos,0))),\"\"),\"\")","v":""},null,{"$f":"IF(ISNUMBER(N27),IFERROR(INDIRECT(CONCATENATE(Evento,1+MATCH(N27,Eventos,0))),\"\"),\"\")","v":""},null,{"$f":"IF(ISNUMBER(P27),IFERROR(INDIRECT(CONCATENATE(Evento,1+MATCH(P27,Eventos,0))),\"\"),\"\")","v":""}]
[null,{"$f":"IF(ISNUMBER(B27),IFERROR(INDIRECT(CONCATENATE(Agenda,1+MATCH(B27,Agendas,0))),\"\"),\"\")","v":""},null,{"$f":"IF(ISNUMBER(D27),IFERROR(INDIRECT(CONCATENATE(Agenda,1+MATCH(D27,Agendas,0))),\"\"),\"\")","v":""},null,{"$f":"IF(ISNUMBER(F27),IFERROR(INDIRECT(CONCATENATE(Agenda,1+MATCH(F27,Agendas,0))),\"\"),\"\")","v":""},null,{"$f":"IF(ISNUMBER(H27),IFERROR(INDIRECT(CONCATENATE(Agenda,1+MATCH(H27,Agendas,0))),\"\"),\"\")","v":""},null,{"$f":"IF(ISNUMBER(J27),IFERROR(INDIRECT(CONCATENATE(Agenda,1+MATCH(J27,Agendas,0))),\"\"),\"\")","v":""},null,{"$f":"IF(ISNUMBER(L27),IFERROR(INDIRECT(CONCATENATE(Agenda,1+MATCH(L27,Agendas,0))),\"\"),\"\")","v":""},null,{"$f":"IF(ISNUMBER(N27),IFERROR(INDIRECT(CONCATENATE(Agenda,1+MATCH(N27,Agendas,0))),\"\"),\"\")","v":""},null,{"$f":"IF(ISNUMBER(P27),IFERROR(INDIRECT(CONCATENATE(Agenda,1+MATCH(P27,Agendas,0))),\"\"),\"\")","v":""}]
[]
[]
[]
[{"$f":"IF(B33=\"\",\"\",WEEKNUM(B33,1))","v":23},{"$f":"P27","v":"2010-05-30"},{"$f":"IF(ISNUMBER(B33),IFERROR(INDIRECT(CONCATENATE(Fiesta,2+MATCH(B33,Fiestas,0))),\"\"),\"\")","v":""},{"$f":"IF(P27<EOMONTH($D$1,0),P27+1,\"\")","v":"2010-05-31"},{"$f":"IF(ISNUMBER(D33),IFERROR(INDIRECT(CONCATENATE(Fiesta,2+MATCH(D33,Fiestas,0))),\"\"),\"\")","v":"Memorial Day"},{"$f":"IF(D33<EOMONTH($D$1,0),D33+1,\"\")","v":""},{"$f":"IF(ISNUMBER(F33),IFERROR(INDIRECT(CONCATENATE(Fiesta,2+MATCH(F33,Fiestas,0))),\"\"),\"\")","v":""},"Notes:",null,null,null,null,null,null,null,null,null,{"$f":"IF(D33=\"\",\"\",WEEKNUM(D33,2))","v":23}]
[null,{"$f":"IF(ISNUMBER(B33),IFERROR(INDIRECT(CONCATENATE(Evento,1+MATCH(B33,Eventos,0))),\"\"),\"\")","v":""},null,{"$f":"IF(ISNUMBER(D33),IFERROR(INDIRECT(CONCATENATE(Evento,1+MATCH(D33,Eventos,0))),\"\"),\"\")","v":"World No Tobacco Day"},null,{"$f":"IF(ISNUMBER(F33),IFERROR(INDIRECT(CONCATENATE(Evento,1+MATCH(F33,Eventos,0))),\"\"),\"\")","v":""}]
[null,{"$f":"IF(ISNUMBER(B33),IFERROR(INDIRECT(CONCATENATE(Agenda,1+MATCH(B33,Agendas,0))),\"\"),\"\")","v":""},null,{"$f":"IF(ISNUMBER(D33),IFERROR(INDIRECT(CONCATENATE(Agenda,1+MATCH(D33,Agendas,0))),\"\"),\"\")","v":""},null,{"$f":"IF(ISNUMBER(F33),IFERROR(INDIRECT(CONCATENATE(Agenda,1+MATCH(F33,Agendas,0))),\"\"),\"\")","v":""}]

{"sheet":"Jun","index":9,"n_rows":35,"n_cols":18,"rows_kept":35,"cut":false,"hidden":false,"merged":[[36,7,36,8],[36,9,36,10],[36,11,36,12],[37,7,37,8],[37,9,37,10],[37,11,37,12],[36,13,36,16],[37,13,37,16],[34,7,34,8],[34,9,34,10],[34,11,34,12],[34,13,34,14],[34,15,34,16],[35,7,35,8],[35,9,35,10],[35,11,35,12],[35,13,35,14],[35,15,35,16],[37,1,37,2],[37,3,37,4],[37,5,37,6],[36,1,36,2],[36,3,36,4],[36,5,36,6],[35,1,35,2],[35,3,35,4],[35,5,35,6],[34,1,34,2],[34,3,34,4],[34,5,34,6],[31,11,31,12],[31,13,31,14],[31,15,31,16],[33,1,33,2],[33,3,33,4],[33,5,33,6],[31,1,31,2],[31,3,31,4],[31,5,31,6],[31,7,31,8],[31,9,31,10],[32,7,32,8],[32,9,32,10],[32,11,32,12],[32,13,32,14],[32,15,32,16],[33,7,33,8],[33,9,33,10],[33,11,33,12],[33,13,33,14],[33,15,33,16],[29,11,29,12],[29,13,29,14],[29,15,29,16],[30,1,30,2],[30,3,30,4],[30,5,30,6],[30,7,30,8],[30,9,30,10],[30,11,30,12],[30,13,30,14],[30,15,30,16],[29,1,29,2],[29,3,29,4],[29,5,29,6],[29,7,29,8],[29,9,29,10],[27,11,27,12],[27,13,27,14],[27,15,27,16],[28,1,28,2],[28,3,28,4],[28,5,28,6],[28,7,28,8],[28,9,28,10],[28,11,28,12],[28,13,28,14],[28,15,28,16],[27,1,27,2],[27,3,27,4],[27,5,27,6],[27,7,27,8],[27,9,27,10],[24,11,24,12],[24,13,24,14],[24,15,24,16],[25,1,25,2],[25,3,25,4],[25,5,25,6],[25,7,25,8],[25,9,25,10],[25,11,25,12],[25,13,25,14],[25,15,25,16],[24,1,24,2],[24,3,24,4],[24,5,24,6],[24,7,24,8],[24,9,24,10],[22,11,22,12],[22,13,22,14],[22,15,22,16],[23,1,23,2],[23,3,23,4],[23,5,23,6],[23,7,23,8],[23,9,23,10],[23,11,23,12],[23,13,23,14],[23,15,23,16],[22,1,22,2],[22,3,22,4],[22,5,22,6],[22,7,22,8],[22,9,22,10],[19,11,19,12],[19,13,19,14],[19,15,19,16],[21,1,21,2],[21,3,21,4],[21,5,21,6],[21,7,21,8],[21,9,21,10],[21,11,21,12],[21,13,21,14],[21,15,21,16],[19,1,19,2],[19,3,19,4],[19,5,19,6],[19,7,19,8],[19,9,19,10],[17,11,17,12],[17,13,17,14],[17,15,17,16],[18,1,18,2],[18,3,18,4],[18,5,18,6],[18,7,18,8],[18,9,18,10],[18,11,18,12],[18,13,18,14],[18,15,18,16],[17,1,17,2],[17,3,17,4],[17,5,17,6],[17,7,17,8],[17,9,17,10],[15,11,15,12],[15,13,15,14],[15,15,15,16],[16,1,16,2],[16,3,16,4],[16,5,16,6],[16,7,16,8],[16,9,16,10],[16,11,16,12],[16,13,16,14],[16,15,16,16],[15,1,15,2],[15,3,15,4],[15,5,15,6],[15,7,15,8],[15,9,15,10],[12,11,12,12],[12,13,12,14],[12,15,12,16],[13,1,13,2],[13,3,13,4],[13,5,13,6],[13,7,13,8],[13,9,13,10],[13,11,13,12],[13,13,13,14],[13,15,13,16],[12,1,12,2],[12,3,12,4],[12,5,12,6],[12,7,12,8],[12,9,12,10],[10,11,10,12],[10,13,10,14],[10,15,10,16],[11,1,11,2],[11,3,11,4],[11,5,11,6],[11,7,11,8],[11,9,11,10],[11,11,11,12],[11,13,11,14],[11,15,11,16],[10,1,10,2],[10,3,10,4],[10,5,10,6],[10,7,10,8],[10,9,10,10],[7,11,7,12],[7,13,7,14],[7,15,7,16],[9,1,9,2],[9,3,9,4],[9,5,9,6],[9,7,9,8],[9,9,9,10],[9,11,9,12],[9,13,9,14],[9,15,9,16],[7,1,7,2],[7,3,7,4],[7,5,7,6],[7,7,7,8],[7,9,7,10],[5,11,5,12],[5,13,5,14],[5,15,5,16],[6,1,6,2],[6,3,6,4],[6,5,6,6],[6,7,6,8],[6,9,6,10],[6,11,6,12],[6,13,6,14],[6,15,6,16],[5,1,5,2],[5,3,5,4],[5,5,5,6],[5,7,5,8],[5,9,5,10],[0,9,0,11],[1,1,1,2],[1,3,1,4],[1,5,1,6],[1,7,1,8],[1,9,1,10],[1,11,1,12],[1,13,1,14],[0,3,0,8],[1,15,1,16],[3,11,3,12],[3,13,3,14],[3,15,3,16],[4,1,4,2],[4,3,4,4],[4,5,4,6],[4,7,4,8],[4,9,4,10],[4,11,4,12],[4,13,4,14],[4,15,4,16],[3,1,3,2],[3,3,3,4],[3,5,3,6],[3,7,3,8],[3,9,3,10]]}
[null,null,null,{"$f":"DATE(Cal!M3,6,1)","v":"2010-06-01"},null,null,null,null,null,{"$f":"Cal!$M$3","v":2010}]
[null,{"$f":"DATE(2010,2,7)","v":"2010-02-07"},null,{"$f":"DATE(2010,2,1)","v":"2010-02-01"},null,{"$f":"DATE(2010,2,2)","v":"2010-02-02"},null,{"$f":"DATE(2010,2,3)","v":"2010-02-03"},null,{"$f":"DATE(2010,2,4)","v":"2010-02-04"},null,{"$f":"DATE(2010,2,5)","v":"2010-02-05"},null,{"$f":"DATE(2010,2,6)","v":"2010-02-06"},null,{"$f":"DATE(2010,2,7)","v":"2010-02-07"}]
[{"$f":"IF(N3=\"\",\"\",WEEKNUM(N3,1))","v":23},null,{"$f":"IF(ISNUMBER(B3),IFERROR(INDIRECT(CONCATENATE(Fiesta,2+MATCH(B3,Fiestas,0))),\"\"),\"\")","v":""},{"$f":"IF(WEEKDAY($D$1)=2,$D$1,\"\")","v":""},{"$f":"IF(ISNUMBER(D3),IFERROR(INDIRECT(CONCATENATE(Fiesta,2+MATCH(D3,Fiestas,0))),\"\"),\"\")","v":""},{"$f":"IF(D3<>\"\",D3+1,IF(WEEKDAY($D$1)=3,$D$1,\"\"))","v":"2010-06-01"},{"$f":"IF(ISNUMBER(F3),IFERROR(INDIRECT(CONCATENATE(Fiesta,2+MATCH(F3,Fiestas,0))),\"\"),\"\")","v":""},{"$f":"IF(F3<>\"\",F3+1,IF(WEEKDAY($D$1)=4,$D$1,\"\"))","v":"2010-06-02"},{"$f":"IF(ISNUMBER(H3),IFERROR(INDIRECT(CONCATENATE(Fiesta,2+MATCH(H3,Fiestas,0))),\"\"),\"\")","v":""},{"$f":"IF(H3<>\"\",H3+1,IF(WEEKDAY($D$1)=5,$D$1,\"\"))","v":"2010-06-03"},{"$f":"IF(ISNUMBER(J3),IFERROR(INDIRECT(CONCATENATE(Fiesta,2+MATCH(J3,Fiestas,0))),\"\"),\"\")","v":""},{"$f":"IF(J3<>\"\",J3+1,IF(WEEKDAY($D$1)=6,$D$1,\"\"))","v":"2010-06-04"},{"$f":"IF(ISNUMBER(L3),IFERROR(INDIRECT(CONCATENATE(Fiesta,2+MATCH(L3,Fiestas,0))),\"\"),\"\")","v":""},{"$f":"IF(L3<>\"\",L3+1,IF(WEEKDAY($D$1)=7,$D$1,\"\"))","v":"2010-06-05"},{"$f":"IF(ISNUMBER(N3),IFERROR(INDIRECT(CONCATENATE(Fiesta,2+MATCH(N3,Fiestas,0))),\"\"),\"\")","v":""},{"$f":"IF(N3<>\"\",N3+1,IF(WEEKDAY($D$1)=1,$D$1,\"\"))","v":"2010-06-06"},{"$f":"IF(ISNUMBER(P3),IFERROR(INDIRECT(CONCATENATE(Fiesta,2+MATCH(P3,Fiestas,0))),\"\"),\"\")","v":""},{"$f":"IF(P3=\"\",\"\",WEEKNUM(P3,2))","v":23}]
[null,{"$f":"IF(ISNUMBER(B3),IFERROR(INDIRECT(CONCATENATE(Evento,1+MATCH(B3,Eventos,0))),\"\"),\"\")","v":""},null,{"$f":"IF(ISNUMBER(D3),IFERROR(INDIRECT(CONCATENATE(Evento,1+MATCH(D3,Eventos,0))),\"\"),\"\")","v":""},null,{"$f":"IF(ISNUMBER(F3),IFERROR(INDIRECT(CONCATENATE(Evento,1+MATCH(F3,Eventos,0))),\"\"),\"\")","v":""},null,{"$f":"IF(ISNUMBER(H3),IFERROR(INDIRECT(CONCATENATE(Evento,1+MATCH(H3,Eventos,0))),\"\"),\"\")","v":""},null,{"$f":"IF(ISNUMBER(J3),IFERROR(INDIRECT(CONCATENATE(Evento,1+MATCH(J3,Eventos,0))),\"\"),\"\")","v":""},null,{"$f":"IF(ISNUMBER(L3),IFERROR(INDIRECT(CONCATENATE(Evento,1+MATCH(L3,Eventos,0))),\"\"),\"\")","v":""},null,{"$f":"IF(ISNUMBER(N3),IFERROR(INDIRECT(CONCATENATE(Evento,1+MATCH(N3,Eventos,0))),\"\"),\"\")","v":"World Environment Day"},null,{"$f":"IF(ISNUMBER(P3),IFERROR(INDIRECT(CONCATENATE(Evento,1+MATCH(P3,Eventos,0))),\"\"),\"\")","v":""}]
[null,{"$f":"IF(ISNUMBER(B3),IFERROR(INDIRECT(CONCATENATE(Agenda,1+MATCH(B3,Agendas,0))),\"\"),\"\")","v":""},null,{"$f":"IF(ISNUMBER(D3),IFERROR(INDIRECT(CONCATENATE(Agenda,1+MATCH(D3,Agendas,0))),\"\"),\"\")","v":""},null,{"$f":"IF(ISNUMBER(F3),IFERROR(INDIRECT(CONCATENATE(Agenda,1+MATCH(F3,Agendas,0))),\"\"),\"\")","v":""},null,{"$f":"IF(ISNUMBER(H3),IFERROR(INDIRECT(CONCATENATE(Agenda,1+MATCH(H3,Agendas,0))),\"\"),\"\")","v":""},null,{"$f":"IF(ISNUMBER(J3),IFERROR(INDIRECT(CONCATENATE(Agenda,1+MATCH(J3,Agendas,0))),\"\"),\"\")","v":""},null,{"$f":"IF(ISNUMBER(L3),IFERROR(INDIRECT(CONCATENATE(Agenda,1+MATCH(L3,Agendas,0))),\"\"),\"\")","v":""},null,{"$f":"IF(ISNUMBER(N3),IFERROR(INDIRECT(CONCATENATE(Agenda,1+MATCH(N3,Agendas,0))),\"\"),\"\")","v":""},null,{"$f":"IF(ISNUMBER(P3),IFERROR(INDIRECT(CONCATENATE(Agenda,1+MATCH(P3,Agendas,0))),\"\"),\"\")","v":""}]
[]
[]
[]
[{"$f":"WEEKNUM(B9,1)","v":24},{"$f":"P3","v":"2010-06-06"},{"$f":"IF(ISNUMBER(B9),IFERROR(INDIRECT(CONCATENATE(Fiesta,2+MATCH(B9,Fiestas,0))),\"\"),\"\")","v":""},{"$f":"P3+1","v":"2010-06-07"},{"$f":"IF(ISNUMBER(D9),IFERROR(INDIRECT(CONCATENATE(Fiesta,2+MATCH(D9,Fiestas,0))),\"\"),\"\")","v":""},{"$f":"D9+1","v":"2010-06-08"},{"$f":"IF(ISNUMBER(F9),IFERROR(INDIRECT(CONCATENATE(Fiesta,2+MATCH(F9,Fiestas,0))),\"\"),\"\")","v":""},{"$f":"F9+1","v":"2010-06-09"},{"$f":"IF(ISNUMBER(H9),IFERROR(INDIRECT(CONCATENATE(Fiesta,2+MATCH(H9,Fiestas,0))),\"\"),\"\")","v":""},{"$f":"H9+1","v":"2010-06-10"},{"$f":"IF(ISNUMBER(J9),IFERROR(INDIRECT(CONCATENATE(Fiesta,2+MATCH(J9,Fiestas,0))),\"\"),\"\")","v":""},{"$f":"J9+1","v":"2010-06-11"},{"$f":"IF(ISNUMBER(L9),IFERROR(INDIRECT(CONCATENATE(Fiesta,2+MATCH(L9,Fiestas,0))),\"\"),\"\")","v":""},{"$f":"L9+1","v":"2010-06-12"},{"$f":"IF(ISNUMBER(N9),IFERROR(INDIRECT(CONCATENATE(Fiesta,2+MATCH(N9,Fiestas,0))),\"\"),\"\")","v":""},{"$f":"N9+1","v":"2010-06-13"},{"$f":"IF(ISNUMBER(P9),IFERROR(INDIRECT(CONCATENATE(Fiesta,2+MATCH(P9,Fiestas,0))),\"\"),\"\")","v":""},{"$f":"WEEKNUM(D9,2)","v":24}]
[null,{"$f":"IF(ISNUMBER(B9),IFERROR(INDIRECT(CONCATENATE(Evento,1+MATCH(B9,Eventos,0))),\"\"),\"\")","v":""},null,{"$f":"IF(ISNUMBER(D9),IFERROR(INDIRECT(CONCATENATE(Evento,1+MATCH(D9,Eventos,0))),\"\"),\"\")","v":""},null,{"$f":"IF(ISNUMBER(F9),IFERROR(INDIRECT(CONCATENATE(Evento,1+MATCH(F9,Eventos,0))),\"\"),\"\")","v":"World Ocean Day"},null,{"$f":"IF(ISNUMBER(H9),IFERROR(INDIRECT(CONCATENATE(Evento,1+MATCH(H9,Eventos,0))),\"\"),\"\")","v":""},null,{"$f":"IF(ISNUMBER(J9),IFERROR(INDIRECT(CONCATENATE(Evento,1+MATCH(J9,Eventos,0))),\"\"),\"\")","v":""},null,{"$f":"IF(ISNUMBER(L9),IFERROR(INDIRECT(CONCATENATE(Evento,1+MATCH(L9,Eventos,0))),\"\"),\"\")","v":""},null,{"$f":"IF(ISNUMBER(N9),IFERROR(INDIRECT(CONCATENATE(Evento,1+MATCH(N9,Eventos,0))),\"\"),\"\")","v":"World Day Against Child Labour"},null,{"$f":"IF(ISNUMBER(P9),IFERROR(INDIRECT(CONCATENATE(Evento,1+MATCH(P9,Eventos,0))),\"\"),\"\")","v":""}]
[null,{"$f":"IF(ISNUMBER(B9),IFERROR(INDIRECT(CONCATENATE(Agenda,1+MATCH(B9,Agendas,0))),\"\"),\"\")","v":""},null,{"$f":"IF(ISNUMBER(D9),IFERROR(INDIRECT(CONCATENATE(Agenda,1+MATCH(D9,Agendas,0))),\"\"),\"\")","v":""},null,{"$f":"IF(ISNUMBER(F9),IFERROR(INDIRECT(CONCATENATE(Agenda,1+MATCH(F9,Agendas,0))),\"\"),\"\")","v":""},null,{"$f":"IF(ISNUMBER(H9),IFERROR(INDIRECT(CONCATENATE(Agenda,1+MATCH(H9,Agendas,0))),\"\"),\"\")","v":""},null,{"$f":"IF(ISNUMBER(J9),IFERROR(INDIRECT(CONCATENATE(Agenda,1+MATCH(J9,Agendas,0))),\"\"),\"\")","v":""},null,{"$f":"IF(ISNUMBER(L9),IFERROR(INDIRECT(CONCATENATE(Agenda,1+MATCH(L9,Agendas,0))),\"\"),\"\")","v":""},null,{"$f":"IF(ISNUMBER(N9),IFERROR(INDIRECT(CONCATENATE(Agenda,1+MATCH(N9,Agendas,0))),\"\"),\"\")","v":""},null,{"$f":"IF(ISNUMBER(P9),IFERROR(INDIRECT(CONCATENATE(Agenda,1+MATCH(P9,Agendas,0))),\"\"),\"\")","v":""}]
[]
[]
[]
[{"$f":"WEEKNUM(B15,1)","v":25},{"$f":"P9","v":"2010-06-13"},{"$f":"IF(ISNUMBER(B15),IFERROR(INDIRECT(CONCATENATE(Fiesta,2+MATCH(B15,Fiestas,0))),\"\"),\"\")","v":""},{"$f":"P9+1","v":"2010-06-14"},{"$f":"IF(ISNUMBER(D15),IFERROR(INDIRECT(CONCATENATE(Fiesta,2+MATCH(D15,Fiestas,0))),\"\"),\"\")","v":""},{"$f":"D15+1","v":"2010-06-15"},{"$f":"IF(ISNUMBER(F15),IFERROR(INDIRECT(CONCATENATE(Fiesta,2+MATCH(F15,Fiestas,0))),\"\"),\"\")","v":""},{"$f":"F15+1","v":"2010-06-16"},{"$f":"IF(ISNUMBER(H15),IFERROR(INDIRECT(CONCATENATE(Fiesta,2+MATCH(H15,Fiestas,0))),\"\"),\"\")","v":""},{"$f":"H15+1","v":"2010-06-17"},{"$f":"IF(ISNUMBER(J15),IFERROR(INDIRECT(CONCATENATE(Fiesta,2+MATCH(J15,Fiestas,0))),\"\"),\"\")","v":""},{"$f":"J15+1","v":"2010-06-18"},{"$f":"IF(ISNUMBER(L15),IFERROR(INDIRECT(CONCATENATE(Fiesta,2+MATCH(L15,Fiestas,0))),\"\"),\"\")","v":""},{"$f":"L15+1","v":"2010-06-19"},{"$f":"IF(ISNUMBER(N15),IFERROR(INDIRECT(CONCATENATE(Fiesta,2+MATCH(N15,Fiestas,0))),\"\"),\"\")","v":""},{"$f":"N15+1","v":"2010-06-20"},{"$f":"IF(ISNUMBER(P15),IFERROR(INDIRECT(CONCATENATE(Fiesta,2+MATCH(P15,Fiestas,0))),\"\"),\"\")","v":""},{"$f":"WEEKNUM(D15,2)","v":25}]
[null,{"$f":"IF(ISNUMBER(B15),IFERROR(INDIRECT(CONCATENATE(Evento,1+MATCH(B15,Eventos,0))),\"\"),\"\")","v":""},null,{"$f":"IF(ISNUMBER(D15),IFERROR(INDIRECT(CONCATENATE(Evento,1+MATCH(D15,Eventos,0))),\"\"),\"\")","v":"World Blood Donor Day"},null,{"$f":"IF(ISNUMBER(F15),IFERROR(INDIRECT(CONCATENATE(Evento,1+MATCH(F15,Eventos,0))),\"\"),\"\")","v":""},null,{"$f":"IF(ISNUMBER(H15),IFERROR(INDIRECT(CONCATENATE(Evento,1+MATCH(H15,Eventos,0))),\"\"),\"\")","v":""},null,{"$f":"IF(ISNUMBER(J15),IFERROR(INDIRECT(CONCATENATE(Evento,1+MATCH(J15,Eventos,0))),\"\"),\"\")","v":"World Day to Combat Desertification and Drought"},null,{"$f":"IF(ISNUMBER(L15),IFERROR(INDIRECT(CONCATENATE(Evento,1+MATCH(L15,Eventos,0))),\"\"),\"\")","v":""},null,{"$f":"IF(ISNUMBER(N15),IFERROR(INDIRECT(CONCATENATE(Evento,1+MATCH(N15,Eventos,0))),\"\"),\"\")","v":""},null,{"$f":"IF(ISNUMBER(P15),IFERROR(INDIRECT(CONCATENATE(Evento,1+MATCH(P15,Eventos,0))),\"\"),\"\")","v":"World Refugee Day"}]
[null,{"$f":"IF(ISNUMBER(B15),IFERROR(INDIRECT(CONCATENATE(Agenda,1+MATCH(B15,Agendas,0))),\"\"),\"\")","v":""},null,{"$f":"IF(ISNUMBER(D15),IFERROR(INDIRECT(CONCATENATE(Agenda,1+MATCH(D15,Agendas,0))),\"\"),\"\")","v":""},null,{"$f":"IF(ISNUMBER(F15),IFERROR(INDIRECT(CONCATENATE(Agenda,1+MATCH(F15,Agendas,0))),\"\"),\"\")","v":""},null,{"$f":"IF(ISNUMBER(H15),IFERROR(INDIRECT(CONCATENATE(Agenda,1+MATCH(H15,Agendas,0))),\"\"),\"\")","v":""},null,{"$f":"IF(ISNUMBER(J15),IFERROR(INDIRECT(CONCATENATE(Agenda,1+MATCH(J15,Agendas,0))),\"\"),\"\")","v":""},null,{"$f":"IF(ISNUMBER(L15),IFERROR(INDIRECT(CONCATENATE(Agenda,1+MATCH(L15,Agendas,0))),\"\"),\"\")","v":""},null,{"$f":"IF(ISNUMBER(N15),IFERROR(INDIRECT(CONCATENATE(Agenda,1+MATCH(N15,Agendas,0))),\"\"),\"\")","v":""},null,{"$f":"IF(ISNUMBER(P15),IFERROR(INDIRECT(CONCATENATE(Agenda,1+MATCH(P15,Agendas,0))),\"\"),\"\")","v":""}]
[]
[]
[]
[{"$f":"WEEKNUM(B21,1)","v":26},{"$f":"P15","v":"2010-06-20"},{"$f":"IF(ISNUMBER(B21),IFERROR(INDIRECT(CONCATENATE(Fiesta,2+MATCH(B21,Fiestas,0))),\"\"),\"\")","v":""},{"$f":"P15+1","v":"2010-06-21"},{"$f":"IF(ISNUMBER(D21),IFERROR(INDIRECT(CONCATENATE(Fiesta,2+MATCH(D21,Fiestas,0))),\"\"),\"\")","v":""},{"$f":"D21+1","v":"2010-06-22"},{"$f":"IF(ISNUMBER(F21),IFERROR(INDIRECT(CONCATENATE(Fiesta,2+MATCH(F21,Fiestas,0))),\"\"),\"\")","v":""},{"$f":"F21+1","v":"2010-06-23"},{"$f":"IF(ISNUMBER(H21),IFERROR(INDIRECT(CONCATENATE(Fiesta,2+MATCH(H21,Fiestas,0))),\"\"),\"\")","v":""},{"$f":"H21+1","v":"2010-06-24"},{"$f":"IF(ISNUMBER(J21),IFERROR(INDIRECT(CONCATENATE(Fiesta,2+MATCH(J21,Fiestas,0))),\"\"),\"\")","v":""},{"$f":"J21+1","v":"2010-06-25"},{"$f":"IF(ISNUMBER(L21),IFERROR(INDIRECT(CONCATENATE(Fiesta,2+MATCH(L21,Fiestas,0))),\"\"),\"\")","v":""},{"$f":"L21+1","v":"2010-06-26"},{"$f":"IF(ISNUMBER(N21),IFERROR(INDIRECT(CONCATENATE(Fiesta,2+MATCH(N21,Fiestas,0))),\"\"),\"\")","v":""},{"$f":"N21+1","v":"2010-06-27"},{"$f":"IF(ISNUMBER(P21),IFERROR(INDIRECT(CONCATENATE(Fiesta,2+MATCH(P21,Fiestas,0))),\"\"),\"\")","v":""},{"$f":"WEEKNUM(D21,2)","v":26}]
[null,{"$f":"IF(ISNUMBER(B21),IFERROR(INDIRECT(CONCATENATE(Evento,1+MATCH(B21,Eventos,0))),\"\"),\"\")","v":"World Refugee Day"},null,{"$f":"IF(ISNUMBER(D21),IFERROR(INDIRECT(CONCATENATE(Evento,1+MATCH(D21,Eventos,0))),\"\"),\"\")","v":"World Music Day"},null,{"$f":"IF(ISNUMBER(F21),IFERROR(INDIRECT(CONCATENATE(Evento,1+MATCH(F21,Eventos,0))),\"\"),\"\")","v":""},null,{"$f":"IF(ISNUMBER(H21),IFERROR(INDIRECT(CONCATENATE(Evento,1+MATCH(H21,Eventos,0))),\"\"),\"\")","v":""},null,{"$f":"IF(ISNUMBER(J21),IFERROR(INDIRECT(CONCATENATE(Evento,1+MATCH(J21,Eventos,0))),\"\"),\"\")","v":""},null,{"$f":"IF(ISNUMBER(L21),IFERROR(INDIRECT(CONCATENATE(Evento,1+MATCH(L21,Eventos,0))),\"\"),\"\")","v":""},null,{"$f":"IF(ISNUMBER(N21),IFERROR(INDIRECT(CONCATENATE(Evento,1+MATCH(N21,Eventos,0))),\"\"),\"\")","v":""},null,{"$f":"IF(ISNUMBER(P21),IFERROR(INDIRECT(CONCATENATE(Evento,1+MATCH(P21,Eventos,0))),\"\"),\"\")","v":""}]
[null,{"$f":"IF(ISNUMBER(B21),IFERROR(INDIRECT(CONCATENATE(Agenda,1+MATCH(B21,Agendas,0))),\"\"),\"\")","v":""},null,{"$f":"IF(ISNUMBER(D21),IFERROR(INDIRECT(CONCATENATE(Agenda,1+MATCH(D21,Agendas,0))),\"\"),\"\")","v":""},null,{"$f":"IF(ISNUMBER(F21),IFERROR(INDIRECT(CONCATENATE(Agenda,1+MATCH(F21,Agendas,0))),\"\"),\"\")","v":""},null,{"$f":"IF(ISNUMBER(H21),IFERROR(INDIRECT(CONCATENATE(Agenda,1+MATCH(H21,Agendas,0))),\"\"),\"\")","v":""},null,{"$f":"IF(ISNUMBER(J21),IFERROR(INDIRECT(CONCATENATE(Agenda,1+MATCH(J21,Agendas,0))),\"\"),\"\")","v":""},null,{"$f":"IF(ISNUMBER(L21),IFERROR(INDIRECT(CONCATENATE(Agenda,1+MATCH(L21,Agendas,0))),\"\"),\"\")","v":""},null,{"$f":"IF(ISNUMBER(N21),IFERROR(INDIRECT(CONCATENATE(Agenda,1+MATCH(N21,Agendas,0))),\"\"),\"\")","v":""},null,{"$f":"IF(ISNUMBER(P21),IFERROR(INDIRECT(CONCATENATE(Agenda,1+MATCH(P21,Agendas,0))),\"\"),\"\")","v":""}]
[]
[]
[]
[{"$f":"IF(B27=\"\",\"\",WEEKNUM(B27,1))","v":27},{"$f":"P21","v":"2010-06-27"},{"$f":"IF(ISNUMBER(B27),IFERROR(INDIRECT(CONCATENATE(Fiesta,2+MATCH(B27,Fiestas,0))),\"\"),\"\")","v":""},{"$f":"IF(P21<EOMONTH($D$1,0),P21+1,\"\")","v":"2010-06-28"},{"$f":"IF(ISNUMBER(D27),IFERROR(INDIRECT(CONCATENATE(Fiesta,2+MATCH(D27,Fiestas,0))),\"\"),\"\")","v":""},{"$f":"IF(D27<EOMONTH($D$1,0),D27+1,\"\")","v":"2010-06-29"},{"$f":"IF(ISNUMBER(F27),IFERROR(INDIRECT(CONCATENATE(Fiesta,2+MATCH(F27,Fiestas,0))),\"\"),\"\")","v":""},{"$f":"IF(F27<EOMONTH($D$1,0),F27+1,\"\")","v":"2010-06-30"},{"$f":"IF(ISNUMBER(H27),IFERROR(INDIRECT(CONCATENATE(Fiesta,2+MATCH(H27,Fiestas,0))),\"\"),\"\")","v":""},{"$f":"IF(H27<EOMONTH($D$1,0),H27+1,\"\")","v":""},{"$f":"IF(ISNUMBER(J27),IFERROR(INDIRECT(CONCATENATE(Fiesta,2+MATCH(J27,Fiestas,0))),\"\"),\"\")","v":""},{"$f":"IF(J27<EOMONTH($D$1,0),J27+1,\"\")","v":""},{"$f":"IF(ISNUMBER(L27),IFERROR(INDIRECT(CONCATENATE(Fiesta,2+MATCH(L27,Fiestas,0))),\"\"),\"\")","v":""},{"$f":"IF(L27<EOMONTH($D$1,0),L27+1,\"\")","v":""},{"$f":"IF(ISNUMBER(N27),IFERROR(INDIRECT(CONCATENATE(Fiesta,2+MATCH(N27,Fiestas,0))),\"\"),\"\")","v":""},{"$f":"IF(N27<EOMONTH($D$1,0),N27+1,\"\")","v":""},{"$f":"IF(ISNUMBER(P27),IFERROR(INDIRECT(CONCATENATE(Fiesta,2+MATCH(P27,Fiestas,0))),\"\"),\"\")","v":""},{"$f":"IF(D27=\"\",\"\",WEEKNUM(D27,2))","v":27}]
[null,{"$f":"IF(ISNUMBER(B27),IFERROR(INDIRECT(CONCATENATE(Evento,1+MATCH(B27,Eventos,0))),\"\"),\"\")","v":""},null,{"$f":"IF(ISNUMBER(D27),IFERROR(INDIRECT(CONCATENATE(Evento,1+MATCH(D27,Eventos,0))),\"\"),\"\")","v":""},null,{"$f":"IF(ISNUMBER(F27),IFERROR(INDIRECT(CONCATENATE(Evento,1+MATCH(F27,Eventos,0))),\"\"),\"\")","v":""},null,{"$f":"IF(ISNUMBER(H27),IFERROR(INDIRECT(CONCATENATE(Evento,1+MATCH(H27,Eventos,0))),\"\"),\"\")","v":""},null,{"$f":"IF(ISNUMBER(J27),IFERROR(INDIRECT(CONCATENATE(Evento,1+MATCH(J27,Eventos,0))),\"\"),\"\")","v":""},null,{"$f":"IF(ISNUMBER(L27),IFERROR(INDIRECT(CONCATENATE(Evento,1+MATCH(L27,Eventos,0))),\"\"),\"\")","v":""},null,{"$f":"IF(ISNUMBER(N27),IFERROR(INDIRECT(CONCATENATE(Evento,1+MATCH(N27,Eventos,0))),\"\"),\"\")","v":""},null,{"$f":"IF(ISNUMBER(P27),IFERROR(INDIRECT(CONCATENATE(Evento,1+MATCH(P27,Eventos,0))),\"\"),\"\")","v":""}]
[null,{"$f":"IF(ISNUMBER(B27),IFERROR(INDIRECT(CONCATENATE(Agenda,1+MATCH(B27,Agendas,0))),\"\"),\"\")","v":""},null,{"$f":"IF(ISNUMBER(D27),IFERROR(INDIRECT(CONCATENATE(Agenda,1+MATCH(D27,Agendas,0))),\"\"),\"\")","v":""},null,{"$f":"IF(ISNUMBER(F27),IFERROR(INDIRECT(CONCATENATE(Agenda,1+MATCH(F27,Agendas,0))),\"\"),\"\")","v":""},null,{"$f":"IF(ISNUMBER(H27),IFERROR(INDIRECT(CONCATENATE(Agenda,1+MATCH(H27,Agendas,0))),\"\"),\"\")","v":""},null,{"$f":"IF(ISNUMBER(J27),IFERROR(INDIRECT(CONCATENATE(Agenda,1+MATCH(J27,Agendas,0))),\"\"),\"\")","v":""},null,{"$f":"IF(ISNUMBER(L27),IFERROR(INDIRECT(CONCATENATE(Agenda,1+MATCH(L27,Agendas,0))),\"\"),\"\")","v":""},null,{"$f":"IF(ISNUMBER(N27),IFERROR(INDIRECT(CONCATENATE(Agenda,1+MATCH(N27,Agendas,0))),\"\"),\"\")","v":""},null,{"$f":"IF(ISNUMBER(P27),IFERROR(INDIRECT(CONCATENATE(Agenda,1+MATCH(P27,Agendas,0))),\"\"),\"\")","v":""}]
[]
[]
[]
[{"$f":"IF(B33=\"\",\"\",WEEKNUM(B33,1))","v":""},{"$f":"P27","v":""},{"$f":"IF(ISNUMBER(B33),IFERROR(INDIRECT(CONCATENATE(Fiesta,2+MATCH(B33,Fiestas,0))),\"\"),\"\")","v":""},{"$f":"IF(P27<EOMONTH($D$1,0),P27+1,\"\")","v":""},{"$f":"IF(ISNUMBER(D33),IFERROR(INDIRECT(CONCATENATE(Fiesta,2+MATCH(D33,Fiestas,0))),\"\"),\"\")","v":""},{"$f":"IF(D33<EOMONTH($D$1,0),D33+1,\"\")","v":""},{"$f":"IF(ISNUMBER(F33),IFERROR(INDIRECT(CONCATENATE(Fiesta,2+MATCH(F33,Fiestas,0))),\"\"),\"\")","v":""},"Notes:",null,null,null,null,null,null,null,null,null,{"$f":"IF(D33=\"\",\"\",WEEKNUM(D33,2))","v":""}]
[null,{"$f":"IF(ISNUMBER(B33),IFERROR(INDIRECT(CONCATENATE(Evento,1+MATCH(B33,Eventos,0))),\"\"),\"\")","v":""},null,{"$f":"IF(ISNUMBER(D33),IFERROR(INDIRECT(CONCATENATE(Evento,1+MATCH(D33,Eventos,0))),\"\"),\"\")","v":""},null,{"$f":"IF(ISNUMBER(F33),IFERROR(INDIRECT(CONCATENATE(Evento,1+MATCH(F33,Eventos,0))),\"\"),\"\")","v":""}]
[null,{"$f":"IF(ISNUMBER(B33),IFERROR(INDIRECT(CONCATENATE(Agenda,1+MATCH(B33,Agendas,0))),\"\"),\"\")","v":""},null,{"$f":"IF(ISNUMBER(D33),IFERROR(INDIRECT(CONCATENATE(Agenda,1+MATCH(D33,Agendas,0))),\"\"),\"\")","v":""},null,{"$f":"IF(ISNUMBER(F33),IFERROR(INDIRECT(CONCATENATE(Agenda,1+MATCH(F33,Agendas,0))),\"\"),\"\")","v":""}]

{"sheet":"Jul","index":10,"n_rows":35,"n_cols":18,"rows_kept":35,"cut":false,"hidden":false,"merged":[[36,7,36,8],[36,9,36,10],[36,11,36,12],[37,7,37,8],[37,9,37,10],[37,11,37,12],[36,13,36,16],[37,13,37,16],[34,7,34,8],[34,9,34,10],[34,11,34,12],[34,13,34,14],[34,15,34,16],[35,7,35,8],[35,9,35,10],[35,11,35,12],[35,13,35,14],[35,15,35,16],[37,1,37,2],[37,3,37,4],[37,5,37,6],[36,1,36,2],[36,3,36,4],[36,5,36,6],[35,1,35,2],[35,3,35,4],[35,5,35,6],[34,1,34,2],[34,3,34,4],[34,5,34,6],[31,11,31,12],[31,13,31,14],[31,15,31,16],[33,1,33,2],[33,3,33,4],[33,5,33,6],[31,1,31,2],[31,3,31,4],[31,5,31,6],[31,7,31,8],[31,9,31,10],[32,7,32,8],[32,9,32,10],[32,11,32,12],[32,13,32,14],[32,15,32,16],[33,7,33,8],[33,9,33,10],[33,11,33,12],[33,13,33,14],[33,15,33,16],[29,11,29,12],[29,13,29,14],[29,15,29,16],[30,1,30,2],[30,3,30,4],[30,5,30,6],[30,7,30,8],[30,9,30,10],[30,11,30,12],[30,13,30,14],[30,15,30,16],[29,1,29,2],[29,3,29,4],[29,5,29,6],[29,7,29,8],[29,9,29,10],[27,11,27,12],[27,13,27,14],[27,15,27,16],[28,1,28,2],[28,3,28,4],[28,5,28,6],[28,7,28,8],[28,9,28,10],[28,11,28,12],[28,13,28,14],[28,15,28,16],[27,1,27,2],[27,3,27,4],[27,5,27,6],[27,7,27,8],[27,9,27,10],[24,11,24,12],[24,13,24,14],[24,15,24,16],[25,1,25,2],[25,3,25,4],[25,5,25,6],[25,7,25,8],[25,9,25,10],[25,11,25,12],[25,13,25,14],[25,15,25,16],[24,1,24,2],[24,3,24,4],[24,5,24,6],[24,7,24,8],[24,9,24,10],[22,11,22,12],[22,13,22,14],[22,15,22,16],[23,1,23,2],[23,3,23,4],[23,5,23,6],[23,7,23,8],[23,9,23,10],[23,11,23,12],[23,13,23,14],[23,15,23,16],[22,1,22,2],[22,3,22,4],[22,5,22,6],[22,7,22,8],[22,9,22,10],[19,11,19,12],[19,13,19,14],[19,15,19,16],[21,1,21,2],[21,3,21,4],[21,5,21,6],[21,7,21,8],[21,9,21,10],[21,11,21,12],[21,13,21,14],[21,15,21,16],[19,1,19,2],[19,3,19,4],[19,5,19,6],[19,7,19,8],[19,9,19,10],[17,11,17,12],[17,13,17,14],[17,15,17,16],[18,1,18,2],[18,3,18,4],[18,5,18,6],[18,7,18,8],[18,9,18,10],[18,11,18,12],[18,13,18,14],[18,15,18,16],[17,1,17,2],[17,3,17,4],[17,5,17,6],[17,7,17,8],[17,9,17,10],[15,11,15,12],[15,13,15,14],[15,15,15,16],[16,1,16,2],[16,3,16,4],[16,5,16,6],[16,7,16,8],[16,9,16,10],[16,11,16,12],[16,13,16,14],[16,15,16,16],[15,1,15,2],[15,3,15,4],[15,5,15,6],[15,7,15,8],[15,9,15,10],[12,11,12,12],[12,13,12,14],[12,15,12,16],[13,1,13,2],[13,3,13,4],[13,5,13,6],[13,7,13,8],[13,9,13,10],[13,11,13,12],[13,13,13,14],[13,15,13,16],[12,1,12,2],[12,3,12,4],[12,5,12,6],[12,7,12,8],[12,9,12,10],[10,11,10,12],[10,13,10,14],[10,15,10,16],[11,1,11,2],[11,3,11,4],[11,5,11,6],[11,7,11,8],[11,9,11,10],[11,11,11,12],[11,13,11,14],[11,15,11,16],[10,1,10,2],[10,3,10,4],[10,5,10,6],[10,7,10,8],[10,9,10,10],[7,11,7,12],[7,13,7,14],[7,15,7,16],[9,1,9,2],[9,3,9,4],[9,5,9,6],[9,7,9,8],[9,9,9,10],[9,11,9,12],[9,13,9,14],[9,15,9,16],[7,1,7,2],[7,3,7,4],[7,5,7,6],[7,7,7,8],[7,9,7,10],[5,11,5,12],[5,13,5,14],[5,15,5,16],[6,1,6,2],[6,3,6,4],[6,5,6,6],[6,7,6,8],[6,9,6,10],[6,11,6,12],[6,13,6,14],[6,15,6,16],[5,1,5,2],[5,3,5,4],[5,5,5,6],[5,7,5,8],[5,9,5,10],[0,9,0,11],[1,1,1,2],[1,3,1,4],[1,5,1,6],[1,7,1,8],[1,9,1,10],[1,11,1,12],[1,13,1,14],[0,3,0,8],[1,15,1,16],[3,11,3,12],[3,13,3,14],[3,15,3,16],[4,1,4,2],[4,3,4,4],[4,5,4,6],[4,7,4,8],[4,9,4,10],[4,11,4,12],[4,13,4,14],[4,15,4,16],[3,1,3,2],[3,3,3,4],[3,5,3,6],[3,7,3,8],[3,9,3,10]]}
[null,null,null,{"$f":"DATE(Cal!M3,7,1)","v":"2010-07-01"},null,null,null,null,null,{"$f":"Cal!$M$3","v":2010}]
[null,{"$f":"DATE(2010,2,7)","v":"2010-02-07"},null,{"$f":"DATE(2010,2,1)","v":"2010-02-01"},null,{"$f":"DATE(2010,2,2)","v":"2010-02-02"},null,{"$f":"DATE(2010,2,3)","v":"2010-02-03"},null,{"$f":"DATE(2010,2,4)","v":"2010-02-04"},null,{"$f":"DATE(2010,2,5)","v":"2010-02-05"},null,{"$f":"DATE(2010,2,6)","v":"2010-02-06"},null,{"$f":"DATE(2010,2,7)","v":"2010-02-07"}]
[{"$f":"IF(N3=\"\",\"\",WEEKNUM(N3,1))","v":27},null,{"$f":"IF(ISNUMBER(B3),IFERROR(INDIRECT(CONCATENATE(Fiesta,2+MATCH(B3,Fiestas,0))),\"\"),\"\")","v":""},{"$f":"IF(WEEKDAY($D$1)=2,$D$1,\"\")","v":""},{"$f":"IF(ISNUMBER(D3),IFERROR(INDIRECT(CONCATENATE(Fiesta,2+MATCH(D3,Fiestas,0))),\"\"),\"\")","v":""},{"$f":"IF(D3<>\"\",D3+1,IF(WEEKDAY($D$1)=3,$D$1,\"\"))","v":""},{"$f":"IF(ISNUMBER(F3),IFERROR(INDIRECT(CONCATENATE(Fiesta,2+MATCH(F3,Fiestas,0))),\"\"),\"\")","v":""},{"$f":"IF(F3<>\"\",F3+1,IF(WEEKDAY($D$1)=4,$D$1,\"\"))","v":""},{"$f":"IF(ISNUMBER(H3),IFERROR(INDIRECT(CONCATENATE(Fiesta,2+MATCH(H3,Fiestas,0))),\"\"),\"\")","v":""},{"$f":"IF(H3<>\"\",H3+1,IF(WEEKDAY($D$1)=5,$D$1,\"\"))","v":"2010-07-01"},{"$f":"IF(ISNUMBER(J3),IFERROR(INDIRECT(CONCATENATE(Fiesta,2+MATCH(J3,Fiestas,0))),\"\"),\"\")","v":""},{"$f":"IF(J3<>\"\",J3+1,IF(WEEKDAY($D$1)=6,$D$1,\"\"))","v":"2010-07-02"},{"$f":"IF(ISNUMBER(L3),IFERROR(INDIRECT(CONCATENATE(Fiesta,2+MATCH(L3,Fiestas,0))),\"\"),\"\")","v":""},{"$f":"IF(L3<>\"\",L3+1,IF(WEEKDAY($D$1)=7,$D$1,\"\"))","v":"2010-07-03"},{"$f":"IF(ISNUMBER(N3),IFERROR(INDIRECT(CONCATENATE(Fiesta,2+MATCH(N3,Fiestas,0))),\"\"),\"\")","v":""},{"$f":"IF(N3<>\"\",N3+1,IF(WEEKDAY($D$1)=1,$D$1,\"\"))","v":"2010-07-04"},{"$f":"IF(ISNUMBER(P3),IFERROR(INDIRECT(CONCATENATE(Fiesta,2+MATCH(P3,Fiestas,0))),\"\"),\"\")","v":"Independence Day"},{"$f":"IF(P3=\"\",\"\",WEEKNUM(P3,2))","v":27}]
[null,{"$f":"IF(ISNUMBER(B3),IFERROR(INDIRECT(CONCATENATE(Evento,1+MATCH(B3,Eventos,0))),\"\"),\"\")","v":""},null,{"$f":"IF(ISNUMBER(D3),IFERROR(INDIRECT(CONCATENATE(Evento,1+MATCH(D3,Eventos,0))),\"\"),\"\")","v":""},null,{"$f":"IF(ISNUMBER(F3),IFERROR(INDIRECT(CONCATENATE(Evento,1+MATCH(F3,Eventos,0))),\"\"),\"\")","v":""},null,{"$f":"IF(ISNUMBER(H3),IFERROR(INDIRECT(CONCATENATE(Evento,1+MATCH(H3,Eventos,0))),\"\"),\"\")","v":""},null,{"$f":"IF(ISNUMBER(J3),IFERROR(INDIRECT(CONCATENATE(Evento,1+MATCH(J3,Eventos,0))),\"\"),\"\")","v":""},null,{"$f":"IF(ISNUMBER(L3),IFERROR(INDIRECT(CONCATENATE(Evento,1+MATCH(L3,Eventos,0))),\"\"),\"\")","v":""},null,{"$f":"IF(ISNUMBER(N3),IFERROR(INDIRECT(CONCATENATE(Evento,1+MATCH(N3,Eventos,0))),\"\"),\"\")","v":""},null,{"$f":"IF(ISNUMBER(P3),IFERROR(INDIRECT(CONCATENATE(Evento,1+MATCH(P3,Eventos,0))),\"\"),\"\")","v":""}]
[null,{"$f":"IF(ISNUMBER(B3),IFERROR(INDIRECT(CONCATENATE(Agenda,1+MATCH(B3,Agendas,0))),\"\"),\"\")","v":""},null,{"$f":"IF(ISNUMBER(D3),IFERROR(INDIRECT(CONCATENATE(Agenda,1+MATCH(D3,Agendas,0))),\"\"),\"\")","v":""},null,{"$f":"IF(ISNUMBER(F3),IFERROR(INDIRECT(CONCATENATE(Agenda,1+MATCH(F3,Agendas,0))),\"\"),\"\")","v":""},null,{"$f":"IF(ISNUMBER(H3),IFERROR(INDIRECT(CONCATENATE(Agenda,1+MATCH(H3,Agendas,0))),\"\"),\"\")","v":""},null,{"$f":"IF(ISNUMBER(J3),IFERROR(INDIRECT(CONCATENATE(Agenda,1+MATCH(J3,Agendas,0))),\"\"),\"\")","v":""},null,{"$f":"IF(ISNUMBER(L3),IFERROR(INDIRECT(CONCATENATE(Agenda,1+MATCH(L3,Agendas,0))),\"\"),\"\")","v":""},null,{"$f":"IF(ISNUMBER(N3),IFERROR(INDIRECT(CONCATENATE(Agenda,1+MATCH(N3,Agendas,0))),\"\"),\"\")","v":""},null,{"$f":"IF(ISNUMBER(P3),IFERROR(INDIRECT(CONCATENATE(Agenda,1+MATCH(P3,Agendas,0))),\"\"),\"\")","v":""}]
[]
[]
[]
[{"$f":"WEEKNUM(B9,1)","v":28},{"$f":"P3","v":"2010-07-04"},{"$f":"IF(ISNUMBER(B9),IFERROR(INDIRECT(CONCATENATE(Fiesta,2+MATCH(B9,Fiestas,0))),\"\"),\"\")","v":"Independence Day"},{"$f":"P3+1","v":"2010-07-05"},{"$f":"IF(ISNUMBER(D9),IFERROR(INDIRECT(CONCATENATE(Fiesta,2+MATCH(D9,Fiestas,0))),\"\"),\"\")","v":"The Fourth of July Federal Holiday"},{"$f":"D9+1","v":"2010-07-06"},{"$f":"IF(ISNUMBER(F9),IFERROR(INDIRECT(CONCATENATE(Fiesta,2+MATCH(F9,Fiestas,0))),\"\"),\"\")","v":""},{"$f":"F9+1","v":"2010-07-07"},{"$f":"IF(ISNUMBER(H9),IFERROR(INDIRECT(CONCATENATE(Fiesta,2+MATCH(H9,Fiestas,0))),\"\"),\"\")","v":""},{"$f":"H9+1","v":"2010-07-08"},{"$f":"IF(ISNUMBER(J9),IFERROR(INDIRECT(CONCATENATE(Fiesta,2+MATCH(J9,Fiestas,0))),\"\"),\"\")","v":""},{"$f":"J9+1","v":"2010-07-09"},{"$f":"IF(ISNUMBER(L9),IFERROR(INDIRECT(CONCATENATE(Fiesta,2+MATCH(L9,Fiestas,0))),\"\"),\"\")","v":""},{"$f":"L9+1","v":"2010-07-10"},{"$f":"IF(ISNUMBER(N9),IFERROR(INDIRECT(CONCATENATE(Fiesta,2+MATCH(N9,Fiestas,0))),\"\"),\"\")","v":""},{"$f":"N9+1","v":"2010-07-11"},{"$f":"IF(ISNUMBER(P9),IFERROR(INDIRECT(CONCATENATE(Fiesta,2+MATCH(P9,Fiestas,0))),\"\"),\"\")","v":""},{"$f":"WEEKNUM(D9,2)","v":28}]
[null,{"$f":"IF(ISNUMBER(B9),IFERROR(INDIRECT(CONCATENATE(Evento,1+MATCH(B9,Eventos,0))),\"\"),\"\")","v":""},null,{"$f":"IF(ISNUMBER(D9),IFERROR(INDIRECT(CONCATENATE(Evento,1+MATCH(D9,Eventos,0))),\"\"),\"\")","v":""},null,{"$f":"IF(ISNUMBER(F9),IFERROR(INDIRECT(CONCATENATE(Evento,1+MATCH(F9,Eventos,0))),\"\"),\"\")","v":""},null,{"$f":"IF(ISNUMBER(H9),IFERROR(INDIRECT(CONCATENATE(Evento,1+MATCH(H9,Eventos,0))),\"\"),\"\")","v":""},null,{"$f":"IF(ISNUMBER(J9),IFERROR(INDIRECT(CONCATENATE(Evento,1+MATCH(J9,Eventos,0))),\"\"),\"\")","v":""},null,{"$f":"IF(ISNUMBER(L9),IFERROR(INDIRECT(CONCATENATE(Evento,1+MATCH(L9,Eventos,0))),\"\"),\"\")","v":""},null,{"$f":"IF(ISNUMBER(N9),IFERROR(INDIRECT(CONCATENATE(Evento,1+MATCH(N9,Eventos,0))),\"\"),\"\")","v":""},null,{"$f":"IF(ISNUMBER(P9),IFERROR(INDIRECT(CONCATENATE(Evento,1+MATCH(P9,Eventos,0))),\"\"),\"\")","v":"World Population Day"}]
[null,{"$f":"IF(ISNUMBER(B9),IFERROR(INDIRECT(CONCATENATE(Agenda,1+MATCH(B9,Agendas,0))),\"\"),\"\")","v":""},null,{"$f":"IF(ISNUMBER(D9),IFERROR(INDIRECT(CONCATENATE(Agenda,1+MATCH(D9,Agendas,0))),\"\"),\"\")","v":""},null,{"$f":"IF(ISNUMBER(F9),IFERROR(INDIRECT(CONCATENATE(Agenda,1+MATCH(F9,Agendas,0))),\"\"),\"\")","v":""},null,{"$f":"IF(ISNUMBER(H9),IFERROR(INDIRECT(CONCATENATE(Agenda,1+MATCH(H9,Agendas,0))),\"\"),\"\")","v":""},null,{"$f":"IF(ISNUMBER(J9),IFERROR(INDIRECT(CONCATENATE(Agenda,1+MATCH(J9,Agendas,0))),\"\"),\"\")","v":""},null,{"$f":"IF(ISNUMBER(L9),IFERROR(INDIRECT(CONCATENATE(Agenda,1+MATCH(L9,Agendas,0))),\"\"),\"\")","v":""},null,{"$f":"IF(ISNUMBER(N9),IFERROR(INDIRECT(CONCATENATE(Agenda,1+MATCH(N9,Agendas,0))),\"\"),\"\")","v":""},null,{"$f":"IF(ISNUMBER(P9),IFERROR(INDIRECT(CONCATENATE(Agenda,1+MATCH(P9,Agendas,0))),\"\"),\"\")","v":""}]
[]
[]
[]
[{"$f":"WEEKNUM(B15,1)","v":29},{"$f":"P9","v":"2010-07-11"},{"$f":"IF(ISNUMBER(B15),IFERROR(INDIRECT(CONCATENATE(Fiesta,2+MATCH(B15,Fiestas,0))),\"\"),\"\")","v":""},{"$f":"P9+1","v":"2010-07-12"},{"$f":"IF(ISNUMBER(D15),IFERROR(INDIRECT(CONCATENATE(Fiesta,2+MATCH(D15,Fiestas,0))),\"\"),\"\")","v":""},{"$f":"D15+1","v":"2010-07-13"},{"$f":"IF(ISNUMBER(F15),IFERROR(INDIRECT(CONCATENATE(Fiesta,2+MATCH(F15,Fiestas,0))),\"\"),\"\")","v":""},{"$f":"F15+1","v":"2010-07-14"},{"$f":"IF(ISNUMBER(H15),IFERROR(INDIRECT(CONCATENATE(Fiesta,2+MATCH(H15,Fiestas,0))),\"\"),\"\")","v":""},{"$f":"H15+1","v":"2010-07-15"},{"$f":"IF(ISNUMBER(J15),IFERROR(INDIRECT(CONCATENATE(Fiesta,2+MATCH(J15,Fiestas,0))),\"\"),\"\")","v":""},{"$f":"J15+1","v":"2010-07-16"},{"$f":"IF(ISNUMBER(L15),IFERROR(INDIRECT(CONCATENATE(Fiesta,2+MATCH(L15,Fiestas,0))),\"\"),\"\")","v":""},{"$f":"L15+1","v":"2010-07-17"},{"$f":"IF(ISNUMBER(N15),IFERROR(INDIRECT(CONCATENATE(Fiesta,2+MATCH(N15,Fiestas,0))),\"\"),\"\")","v":""},{"$f":"N15+1","v":"2010-07-18"},{"$f":"IF(ISNUMBER(P15),IFERROR(INDIRECT(CONCATENATE(Fiesta,2+MATCH(P15,Fiestas,0))),\"\"),\"\")","v":""},{"$f":"WEEKNUM(D15,2)","v":29}]
[null,{"$f":"IF(ISNUMBER(B15),IFERROR(INDIRECT(CONCATENATE(Evento,1+MATCH(B15,Eventos,0))),\"\"),\"\")","v":"World Population Day"},null,{"$f":"IF(ISNUMBER(D15),IFERROR(INDIRECT(CONCATENATE(Evento,1+MATCH(D15,Eventos,0))),\"\"),\"\")","v":""},null,{"$f":"IF(ISNUMBER(F15),IFERROR(INDIRECT(CONCATENATE(Evento,1+MATCH(F15,Eventos,0))),\"\"),\"\")","v":""},null,{"$f":"IF(ISNUMBER(H15),IFERROR(INDIRECT(CONCATENATE(Evento,1+MATCH(H15,Eventos,0))),\"\"),\"\")","v":""},null,{"$f":"IF(ISNUMBER(J15),IFERROR(INDIRECT(CONCATENATE(Evento,1+MATCH(J15,Eventos,0))),\"\"),\"\")","v":""},null,{"$f":"IF(ISNUMBER(L15),IFERROR(INDIRECT(CONCATENATE(Evento,1+MATCH(L15,Eventos,0))),\"\"),\"\")","v":""},null,{"$f":"IF(ISNUMBER(N15),IFERROR(INDIRECT(CONCATENATE(Evento,1+MATCH(N15,Eventos,0))),\"\"),\"\")","v":""},null,{"$f":"IF(ISNUMBER(P15),IFERROR(INDIRECT(CONCATENATE(Evento,1+MATCH(P15,Eventos,0))),\"\"),\"\")","v":""}]
[null,{"$f":"IF(ISNUMBER(B15),IFERROR(INDIRECT(CONCATENATE(Agenda,1+MATCH(B15,Agendas,0))),\"\"),\"\")","v":""},null,{"$f":"IF(ISNUMBER(D15),IFERROR(INDIRECT(CONCATENATE(Agenda,1+MATCH(D15,Agendas,0))),\"\"),\"\")","v":""},null,{"$f":"IF(ISNUMBER(F15),IFERROR(INDIRECT(CONCATENATE(Agenda,1+MATCH(F15,Agendas,0))),\"\"),\"\")","v":""},null,{"$f":"IF(ISNUMBER(H15),IFERROR(INDIRECT(CONCATENATE(Agenda,1+MATCH(H15,Agendas,0))),\"\"),\"\")","v":""},null,{"$f":"IF(ISNUMBER(J15),IFERROR(INDIRECT(CONCATENATE(Agenda,1+MATCH(J15,Agendas,0))),\"\"),\"\")","v":""},null,{"$f":"IF(ISNUMBER(L15),IFERROR(INDIRECT(CONCATENATE(Agenda,1+MATCH(L15,Agendas,0))),\"\"),\"\")","v":""},null,{"$f":"IF(ISNUMBER(N15),IFERROR(INDIRECT(CONCATENATE(Agenda,1+MATCH(N15,Agendas,0))),\"\"),\"\")","v":"My birthday (Pedro Wave)"},null,{"$f":"IF(ISNUMBER(P15),IFERROR(INDIRECT(CONCATENATE(Agenda,1+MATCH(P15,Agendas,0))),\"\"),\"\")","v":""}]
[]
[]
[]
[{"$f":"WEEKNUM(B21,1)","v":30},{"$f":"P15","v":"2010-07-18"},{"$f":"IF(ISNUMBER(B21),IFERROR(INDIRECT(CONCATENATE(Fiesta,2+MATCH(B21,Fiestas,0))),\"\"),\"\")","v":""},{"$f":"P15+1","v":"2010-07-19"},{"$f":"IF(ISNUMBER(D21),IFERROR(INDIRECT(CONCATENATE(Fiesta,2+MATCH(D21,Fiestas,0))),\"\"),\"\")","v":""},{"$f":"D21+1","v":"2010-07-20"},{"$f":"IF(ISNUMBER(F21),IFERROR(INDIRECT(CONCATENATE(Fiesta,2+MATCH(F21,Fiestas,0))),\"\"),\"\")","v":""},{"$f":"F21+1","v":"2010-07-21"},{"$f":"IF(ISNUMBER(H21),IFERROR(INDIRECT(CONCATENATE(Fiesta,2+MATCH(H21,Fiestas,0))),\"\"),\"\")","v":""},{"$f":"H21+1","v":"2010-07-22"},{"$f":"IF(ISNUMBER(J21),IFERROR(INDIRECT(CONCATENATE(Fiesta,2+MATCH(J21,Fiestas,0))),\"\"),\"\")","v":""},{"$f":"J21+1","v":"2010-07-23"},{"$f":"IF(ISNUMBER(L21),IFERROR(INDIRECT(CONCATENATE(Fiesta,2+MATCH(L21,Fiestas,0))),\"\"),\"\")","v":""},{"$f":"L21+1","v":"2010-07-24"},{"$f":"IF(ISNUMBER(N21),IFERROR(INDIRECT(CONCATENATE(Fiesta,2+MATCH(N21,Fiestas,0))),\"\"),\"\")","v":""},{"$f":"N21+1","v":"2010-07-25"},{"$f":"IF(ISNUMBER(P21),IFERROR(INDIRECT(CONCATENATE(Fiesta,2+MATCH(P21,Fiestas,0))),\"\"),\"\")","v":""},{"$f":"WEEKNUM(D21,2)","v":30}]
[null,{"$f":"IF(ISNUMBER(B21),IFERROR(INDIRECT(CONCATENATE(Evento,1+MATCH(B21,Eventos,0))),\"\"),\"\")","v":""},null,{"$f":"IF(ISNUMBER(D21),IFERROR(INDIRECT(CONCATENATE(Evento,1+MATCH(D21,Eventos,0))),\"\"),\"\")","v":""},null,{"$f":"IF(ISNUMBER(F21),IFERROR(INDIRECT(CONCATENATE(Evento,1+MATCH(F21,Eventos,0))),\"\"),\"\")","v":""},null,{"$f":"IF(ISNUMBER(H21),IFERROR(INDIRECT(CONCATENATE(Evento,1+MATCH(H21,Eventos,0))),\"\"),\"\")","v":""},null,{"$f":"IF(ISNUMBER(J21),IFERROR(INDIRECT(CONCATENATE(Evento,1+MATCH(J21,Eventos,0))),\"\"),\"\")","v":""},null,{"$f":"IF(ISNUMBER(L21),IFERROR(INDIRECT(CONCATENATE(Evento,1+MATCH(L21,Eventos,0))),\"\"),\"\")","v":""},null,{"$f":"IF(ISNUMBER(N21),IFERROR(INDIRECT(CONCATENATE(Evento,1+MATCH(N21,Eventos,0))),\"\"),\"\")","v":""},null,{"$f":"IF(ISNUMBER(P21),IFERROR(INDIRECT(CONCATENATE(Evento,1+MATCH(P21,Eventos,0))),\"\"),\"\")","v":""}]
[null,{"$f":"IF(ISNUMBER(B21),IFERROR(INDIRECT(CONCATENATE(Agenda,1+MATCH(B21,Agendas,0))),\"\"),\"\")","v":""},null,{"$f":"IF(ISNUMBER(D21),IFERROR(INDIRECT(CONCATENATE(Agenda,1+MATCH(D21,Agendas,0))),\"\"),\"\")","v":""},null,{"$f":"IF(ISNUMBER(F21),IFERROR(INDIRECT(CONCATENATE(Agenda,1+MATCH(F21,Agendas,0))),\"\"),\"\")","v":""},null,{"$f":"IF(ISNUMBER(H21),IFERROR(INDIRECT(CONCATENATE(Agenda,1+MATCH(H21,Agendas,0))),\"\"),\"\")","v":""},null,{"$f":"IF(ISNUMBER(J21),IFERROR(INDIRECT(CONCATENATE(Agenda,1+MATCH(J21,Agendas,0))),\"\"),\"\")","v":""},null,{"$f":"IF(ISNUMBER(L21),IFERROR(INDIRECT(CONCATENATE(Agenda,1+MATCH(L21,Agendas,0))),\"\"),\"\")","v":""},null,{"$f":"IF(ISNUMBER(N21),IFERROR(INDIRECT(CONCATENATE(Agenda,1+MATCH(N21,Agendas,0))),\"\"),\"\")","v":""},null,{"$f":"IF(ISNUMBER(P21),IFERROR(INDIRECT(CONCATENATE(Agenda,1+MATCH(P21,Agendas,0))),\"\"),\"\")","v":""}]
[]
[]
[]
[{"$f":"IF(B27=\"\",\"\",WEEKNUM(B27,1))","v":31},{"$f":"P21","v":"2010-07-25"},{"$f":"IF(ISNUMBER(B27),IFERROR(INDIRECT(CONCATENATE(Fiesta,2+MATCH(B27,Fiestas,0))),\"\"),\"\")","v":""},{"$f":"IF(P21<EOMONTH($D$1,0),P21+1,\"\")","v":"2010-07-26"},{"$f":"IF(ISNUMBER(D27),IFERROR(INDIRECT(CONCATENATE(Fiesta,2+MATCH(D27,Fiestas,0))),\"\"),\"\")","v":""},{"$f":"IF(D27<EOMONTH($D$1,0),D27+1,\"\")","v":"2010-07-27"},{"$f":"IF(ISNUMBER(F27),IFERROR(INDIRECT(CONCATENATE(Fiesta,2+MATCH(F27,Fiestas,0))),\"\"),\"\")","v":""},{"$f":"IF(F27<EOMONTH($D$1,0),F27+1,\"\")","v":"2010-07-28"},{"$f":"IF(ISNUMBER(H27),IFERROR(INDIRECT(CONCATENATE(Fiesta,2+MATCH(H27,Fiestas,0))),\"\"),\"\")","v":""},{"$f":"IF(H27<EOMONTH($D$1,0),H27+1,\"\")","v":"2010-07-29"},{"$f":"IF(ISNUMBER(J27),IFERROR(INDIRECT(CONCATENATE(Fiesta,2+MATCH(J27,Fiestas,0))),\"\"),\"\")","v":""},{"$f":"IF(J27<EOMONTH($D$1,0),J27+1,\"\")","v":"2010-07-30"},{"$f":"IF(ISNUMBER(L27),IFERROR(INDIRECT(CONCATENATE(Fiesta,2+MATCH(L27,Fiestas,0))),\"\"),\"\")","v":""},{"$f":"IF(L27<EOMONTH($D$1,0),L27+1,\"\")","v":"2010-07-31"},{"$f":"IF(ISNUMBER(N27),IFERROR(INDIRECT(CONCATENATE(Fiesta,2+MATCH(N27,Fiestas,0))),\"\"),\"\")","v":""},{"$f":"IF(N27<EOMONTH($D$1,0),N27+1,\"\")","v":""},{"$f":"IF(ISNUMBER(P27),IFERROR(INDIRECT(CONCATENATE(Fiesta,2+MATCH(P27,Fiestas,0))),\"\"),\"\")","v":""},{"$f":"IF(D27=\"\",\"\",WEEKNUM(D27,2))","v":31}]
[null,{"$f":"IF(ISNUMBER(B27),IFERROR(INDIRECT(CONCATENATE(Evento,1+MATCH(B27,Eventos,0))),\"\"),\"\")","v":""},null,{"$f":"IF(ISNUMBER(D27),IFERROR(INDIRECT(CONCATENATE(Evento,1+MATCH(D27,Eventos,0))),\"\"),\"\")","v":""},null,{"$f":"IF(ISNUMBER(F27),IFERROR(INDIRECT(CONCATENATE(Evento,1+MATCH(F27,Eventos,0))),\"\"),\"\")","v":""},null,{"$f":"IF(ISNUMBER(H27),IFERROR(INDIRECT(CONCATENATE(Evento,1+MATCH(H27,Eventos,0))),\"\"),\"\")","v":""},null,{"$f":"IF(ISNUMBER(J27),IFERROR(INDIRECT(CONCATENATE(Evento,1+MATCH(J27,Eventos,0))),\"\"),\"\")","v":""},null,{"$f":"IF(ISNUMBER(L27),IFERROR(INDIRECT(CONCATENATE(Evento,1+MATCH(L27,Eventos,0))),\"\"),\"\")","v":""},null,{"$f":"IF(ISNUMBER(N27),IFERROR(INDIRECT(CONCATENATE(Evento,1+MATCH(N27,Eventos,0))),\"\"),\"\")","v":""},null,{"$f":"IF(ISNUMBER(P27),IFERROR(INDIRECT(CONCATENATE(Evento,1+MATCH(P27,Eventos,0))),\"\"),\"\")","v":""}]
[null,{"$f":"IF(ISNUMBER(B27),IFERROR(INDIRECT(CONCATENATE(Agenda,1+MATCH(B27,Agendas,0))),\"\"),\"\")","v":""},null,{"$f":"IF(ISNUMBER(D27),IFERROR(INDIRECT(CONCATENATE(Agenda,1+MATCH(D27,Agendas,0))),\"\"),\"\")","v":""},null,{"$f":"IF(ISNUMBER(F27),IFERROR(INDIRECT(CONCATENATE(Agenda,1+MATCH(F27,Agendas,0))),\"\"),\"\")","v":""},null,{"$f":"IF(ISNUMBER(H27),IFERROR(INDIRECT(CONCATENATE(Agenda,1+MATCH(H27,Agendas,0))),\"\"),\"\")","v":""},null,{"$f":"IF(ISNUMBER(J27),IFERROR(INDIRECT(CONCATENATE(Agenda,1+MATCH(J27,Agendas,0))),\"\"),\"\")","v":""},null,{"$f":"IF(ISNUMBER(L27),IFERROR(INDIRECT(CONCATENATE(Agenda,1+MATCH(L27,Agendas,0))),\"\"),\"\")","v":""},null,{"$f":"IF(ISNUMBER(N27),IFERROR(INDIRECT(CONCATENATE(Agenda,1+MATCH(N27,Agendas,0))),\"\"),\"\")","v":""},null,{"$f":"IF(ISNUMBER(P27),IFERROR(INDIRECT(CONCATENATE(Agenda,1+MATCH(P27,Agendas,0))),\"\"),\"\")","v":""}]
[]
[]
[]
[{"$f":"IF(B33=\"\",\"\",WEEKNUM(B33,1))","v":""},{"$f":"P27","v":""},{"$f":"IF(ISNUMBER(B33),IFERROR(INDIRECT(CONCATENATE(Fiesta,2+MATCH(B33,Fiestas,0))),\"\"),\"\")","v":""},{"$f":"IF(P27<EOMONTH($D$1,0),P27+1,\"\")","v":""},{"$f":"IF(ISNUMBER(D33),IFERROR(INDIRECT(CONCATENATE(Fiesta,2+MATCH(D33,Fiestas,0))),\"\"),\"\")","v":""},{"$f":"IF(D33<EOMONTH($D$1,0),D33+1,\"\")","v":""},{"$f":"IF(ISNUMBER(F33),IFERROR(INDIRECT(CONCATENATE(Fiesta,2+MATCH(F33,Fiestas,0))),\"\"),\"\")","v":""},"Notes:",null,null,null,null,null,null,null,null,null,{"$f":"IF(D33=\"\",\"\",WEEKNUM(D33,2))","v":""}]
[null,{"$f":"IF(ISNUMBER(B33),IFERROR(INDIRECT(CONCATENATE(Evento,1+MATCH(B33,Eventos,0))),\"\"),\"\")","v":""},null,{"$f":"IF(ISNUMBER(D33),IFERROR(INDIRECT(CONCATENATE(Evento,1+MATCH(D33,Eventos,0))),\"\"),\"\")","v":""},null,{"$f":"IF(ISNUMBER(F33),IFERROR(INDIRECT(CONCATENATE(Evento,1+MATCH(F33,Eventos,0))),\"\"),\"\")","v":""}]
[null,{"$f":"IF(ISNUMBER(B33),IFERROR(INDIRECT(CONCATENATE(Agenda,1+MATCH(B33,Agendas,0))),\"\"),\"\")","v":""},null,{"$f":"IF(ISNUMBER(D33),IFERROR(INDIRECT(CONCATENATE(Agenda,1+MATCH(D33,Agendas,0))),\"\"),\"\")","v":""},null,{"$f":"IF(ISNUMBER(F33),IFERROR(INDIRECT(CONCATENATE(Agenda,1+MATCH(F33,Agendas,0))),\"\"),\"\")","v":""}]

{"sheet":"Aug","index":11,"n_rows":35,"n_cols":18,"rows_kept":35,"cut":false,"hidden":false,"merged":[[36,7,36,8],[36,9,36,10],[36,11,36,12],[37,7,37,8],[37,9,37,10],[37,11,37,12],[36,13,36,16],[37,13,37,16],[34,7,34,8],[34,9,34,10],[34,11,34,12],[34,13,34,14],[34,15,34,16],[35,7,35,8],[35,9,35,10],[35,11,35,12],[35,13,35,14],[35,15,35,16],[37,1,37,2],[37,3,37,4],[37,5,37,6],[36,1,36,2],[36,3,36,4],[36,5,36,6],[35,1,35,2],[35,3,35,4],[35,5,35,6],[34,1,34,2],[34,3,34,4],[34,5,34,6],[31,11,31,12],[31,13,31,14],[31,15,31,16],[33,1,33,2],[33,3,33,4],[33,5,33,6],[31,1,31,2],[31,3,31,4],[31,5,31,6],[31,7,31,8],[31,9,31,10],[32,7,32,8],[32,9,32,10],[32,11,32,12],[32,13,32,14],[32,15,32,16],[33,7,33,8],[33,9,33,10],[33,11,33,12],[33,13,33,14],[33,15,33,16],[29,11,29,12],[29,13,29,14],[29,15,29,16],[30,1,30,2],[30,3,30,4],[30,5,30,6],[30,7,30,8],[30,9,30,10],[30,11,30,12],[30,13,30,14],[30,15,30,16],[29,1,29,2],[29,3,29,4],[29,5,29,6],[29,7,29,8],[29,9,29,10],[27,11,27,12],[27,13,27,14],[27,15,27,16],[28,1,28,2],[28,3,28,4],[28,5,28,6],[28,7,28,8],[28,9,28,10],[28,11,28,12],[28,13,28,14],[28,15,28,16],[27,1,27,2],[27,3,27,4],[27,5,27,6],[27,7,27,8],[27,9,27,10],[24,11,24,12],[24,13,24,14],[24,15,24,16],[25,1,25,2],[25,3,25,4],[25,5,25,6],[25,7,25,8],[25,9,25,10],[25,11,25,12],[25,13,25,14],[25,15,25,16],[24,1,24,2],[24,3,24,4],[24,5,24,6],[24,7,24,8],[24,9,24,10],[22,11,22,12],[22,13,22,14],[22,15,22,16],[23,1,23,2],[23,3,23,4],[23,5,23,6],[23,7,23,8],[23,9,23,10],[23,11,23,12],[23,13,23,14],[23,15,23,16],[22,1,22,2],[22,3,22,4],[22,5,22,6],[22,7,22,8],[22,9,22,10],[19,11,19,12],[19,13,19,14],[19,15,19,16],[21,1,21,2],[21,3,21,4],[21,5,21,6],[21,7,21,8],[21,9,21,10],[21,11,21,12],[21,13,21,14],[21,15,21,16],[19,1,19,2],[19,3,19,4],[19,5,19,6],[19,7,19,8],[19,9,19,10],[17,11,17,12],[17,13,17,14],[17,15,17,16],[18,1,18,2],[18,3,18,4],[18,5,18,6],[18,7,18,8],[18,9,18,10],[18,11,18,12],[18,13,18,14],[18,15,18,16],[17,1,17,2],[17,3,17,4],[17,5,17,6],[17,7,17,8],[17,9,17,10],[15,11,15,12],[15,13,15,14],[15,15,15,16],[16,1,16,2],[16,3,16,4],[16,5,16,6],[16,7,16,8],[16,9,16,10],[16,11,16,12],[16,13,16,14],[16,15,16,16],[15,1,15,2],[15,3,15,4],[15,5,15,6],[15,7,15,8],[15,9,15,10],[12,11,12,12],[12,13,12,14],[12,15,12,16],[13,1,13,2],[13,3,13,4],[13,5,13,6],[13,7,13,8],[13,9,13,10],[13,11,13,12],[13,13,13,14],[13,15,13,16],[12,1,12,2],[12,3,12,4],[12,5,12,6],[12,7,12,8],[12,9,12,10],[10,11,10,12],[10,13,10,14],[10,15,10,16],[11,1,11,2],[11,3,11,4],[11,5,11,6],[11,7,11,8],[11,9,11,10],[11,11,11,12],[11,13,11,14],[11,15,11,16],[10,1,10,2],[10,3,10,4],[10,5,10,6],[10,7,10,8],[10,9,10,10],[7,11,7,12],[7,13,7,14],[7,15,7,16],[9,1,9,2],[9,3,9,4],[9,5,9,6],[9,7,9,8],[9,9,9,10],[9,11,9,12],[9,13,9,14],[9,15,9,16],[7,1,7,2],[7,3,7,4],[7,5,7,6],[7,7,7,8],[7,9,7,10],[5,11,5,12],[5,13,5,14],[5,15,5,16],[6,1,6,2],[6,3,6,4],[6,5,6,6],[6,7,6,8],[6,9,6,10],[6,11,6,12],[6,13,6,14],[6,15,6,16],[5,1,5,2],[5,3,5,4],[5,5,5,6],[5,7,5,8],[5,9,5,10],[0,9,0,11],[1,1,1,2],[1,3,1,4],[1,5,1,6],[1,7,1,8],[1,9,1,10],[1,11,1,12],[1,13,1,14],[0,3,0,8],[1,15,1,16],[3,11,3,12],[3,13,3,14],[3,15,3,16],[4,1,4,2],[4,3,4,4],[4,5,4,6],[4,7,4,8],[4,9,4,10],[4,11,4,12],[4,13,4,14],[4,15,4,16],[3,1,3,2],[3,3,3,4],[3,5,3,6],[3,7,3,8],[3,9,3,10]]}
[null,null,null,{"$f":"DATE(Cal!M3,8,1)","v":"2010-08-01"},null,null,null,null,null,{"$f":"Cal!$M$3","v":2010}]
[null,{"$f":"DATE(2010,2,7)","v":"2010-02-07"},null,{"$f":"DATE(2010,2,1)","v":"2010-02-01"},null,{"$f":"DATE(2010,2,2)","v":"2010-02-02"},null,{"$f":"DATE(2010,2,3)","v":"2010-02-03"},null,{"$f":"DATE(2010,2,4)","v":"2010-02-04"},null,{"$f":"DATE(2010,2,5)","v":"2010-02-05"},null,{"$f":"DATE(2010,2,6)","v":"2010-02-06"},null,{"$f":"DATE(2010,2,7)","v":"2010-02-07"}]
[{"$f":"IF(N3=\"\",\"\",WEEKNUM(N3,1))","v":""},null,{"$f":"IF(ISNUMBER(B3),IFERROR(INDIRECT(CONCATENATE(Fiesta,2+MATCH(B3,Fiestas,0))),\"\"),\"\")","v":""},{"$f":"IF(WEEKDAY($D$1)=2,$D$1,\"\")","v":""},{"$f":"IF(ISNUMBER(D3),IFERROR(INDIRECT(CONCATENATE(Fiesta,2+MATCH(D3,Fiestas,0))),\"\"),\"\")","v":""},{"$f":"IF(D3<>\"\",D3+1,IF(WEEKDAY($D$1)=3,$D$1,\"\"))","v":""},{"$f":"IF(ISNUMBER(F3),IFERROR(INDIRECT(CONCATENATE(Fiesta,2+MATCH(F3,Fiestas,0))),\"\"),\"\")","v":""},{"$f":"IF(F3<>\"\",F3+1,IF(WEEKDAY($D$1)=4,$D$1,\"\"))","v":""},{"$f":"IF(ISNUMBER(H3),IFERROR(INDIRECT(CONCATENATE(Fiesta,2+MATCH(H3,Fiestas,0))),\"\"),\"\")","v":""},{"$f":"IF(H3<>\"\",H3+1,IF(WEEKDAY($D$1)=5,$D$1,\"\"))","v":""},{"$f":"IF(ISNUMBER(J3),IFERROR(INDIRECT(CONCATENATE(Fiesta,2+MATCH(J3,Fiestas,0))),\"\"),\"\")","v":""},{"$f":"IF(J3<>\"\",J3+1,IF(WEEKDAY($D$1)=6,$D$1,\"\"))","v":""},{"$f":"IF(ISNUMBER(L3),IFERROR(INDIRECT(CONCATENATE(Fiesta,2+MATCH(L3,Fiestas,0))),\"\"),\"\")","v":""},{"$f":"IF(L3<>\"\",L3+1,IF(WEEKDAY($D$1)=7,$D$1,\"\"))","v":""},{"$f":"IF(ISNUMBER(N3),IFERROR(INDIRECT(CONCATENATE(Fiesta,2+MATCH(N3,Fiestas,0))),\"\"),\"\")","v":""},{"$f":"IF(N3<>\"\",N3+1,IF(WEEKDAY($D$1)=1,$D$1,\"\"))","v":"2010-08-01"},{"$f":"IF(ISNUMBER(P3),IFERROR(INDIRECT(CONCATENATE(Fiesta,2+MATCH(P3,Fiestas,0))),\"\"),\"\")","v":""},{"$f":"IF(P3=\"\",\"\",WEEKNUM(P3,2))","v":31}]
[null,{"$f":"IF(ISNUMBER(B3),IFERROR(INDIRECT(CONCATENATE(Evento,1+MATCH(B3,Eventos,0))),\"\"),\"\")","v":""},null,{"$f":"IF(ISNUMBER(D3),IFERROR(INDIRECT(CONCATENATE(Evento,1+MATCH(D3,Eventos,0))),\"\"),\"\")","v":""},null,{"$f":"IF(ISNUMBER(F3),IFERROR(INDIRECT(CONCATENATE(Evento,1+MATCH(F3,Eventos,0))),\"\"),\"\")","v":""},null,{"$f":"IF(ISNUMBER(H3),IFERROR(INDIRECT(CONCATENATE(Evento,1+MATCH(H3,Eventos,0))),\"\"),\"\")","v":""},null,{"$f":"IF(ISNUMBER(J3),IFERROR(INDIRECT(CONCATENATE(Evento,1+MATCH(J3,Eventos,0))),\"\"),\"\")","v":""},null,{"$f":"IF(ISNUMBER(L3),IFERROR(INDIRECT(CONCATENATE(Evento,1+MATCH(L3,Eventos,0))),\"\"),\"\")","v":""},null,{"$f":"IF(ISNUMBER(N3),IFERROR(INDIRECT(CONCATENATE(Evento,1+MATCH(N3,Eventos,0))),\"\"),\"\")","v":""},null,{"$f":"IF(ISNUMBER(P3),IFERROR(INDIRECT(CONCATENATE(Evento,1+MATCH(P3,Eventos,0))),\"\"),\"\")","v":""}]
[null,{"$f":"IF(ISNUMBER(B3),IFERROR(INDIRECT(CONCATENATE(Agenda,1+MATCH(B3,Agendas,0))),\"\"),\"\")","v":""},null,{"$f":"IF(ISNUMBER(D3),IFERROR(INDIRECT(CONCATENATE(Agenda,1+MATCH(D3,Agendas,0))),\"\"),\"\")","v":""},null,{"$f":"IF(ISNUMBER(F3),IFERROR(INDIRECT(CONCATENATE(Agenda,1+MATCH(F3,Agendas,0))),\"\"),\"\")","v":""},null,{"$f":"IF(ISNUMBER(H3),IFERROR(INDIRECT(CONCATENATE(Agenda,1+MATCH(H3,Agendas,0))),\"\"),\"\")","v":""},null,{"$f":"IF(ISNUMBER(J3),IFERROR(INDIRECT(CONCATENATE(Agenda,1+MATCH(J3,Agendas,0))),\"\"),\"\")","v":""},null,{"$f":"IF(ISNUMBER(L3),IFERROR(INDIRECT(CONCATENATE(Agenda,1+MATCH(L3,Agendas,0))),\"\"),\"\")","v":""},null,{"$f":"IF(ISNUMBER(N3),IFERROR(INDIRECT(CONCATENATE(Agenda,1+MATCH(N3,Agendas,0))),\"\"),\"\")","v":""},null,{"$f":"IF(ISNUMBER(P3),IFERROR(INDIRECT(CONCATENATE(Agenda,1+MATCH(P3,Agendas,0))),\"\"),\"\")","v":""}]
[]
[]
[]
[{"$f":"WEEKNUM(B9,1)","v":32},{"$f":"P3","v":"2010-08-01"},{"$f":"IF(ISNUMBER(B9),IFERROR(INDIRECT(CONCATENATE(Fiesta,2+MATCH(B9,Fiestas,0))),\"\"),\"\")","v":""},{"$f":"P3+1","v":"2010-08-02"},{"$f":"IF(ISNUMBER(D9),IFERROR(INDIRECT(CONCATENATE(Fiesta,2+MATCH(D9,Fiestas,0))),\"\"),\"\")","v":""},{"$f":"D9+1","v":"2010-08-03"},{"$f":"IF(ISNUMBER(F9),IFERROR(INDIRECT(CONCATENATE(Fiesta,2+MATCH(F9,Fiestas,0))),\"\"),\"\")","v":""},{"$f":"F9+1","v":"2010-08-04"},{"$f":"IF(ISNUMBER(H9),IFERROR(INDIRECT(CONCATENATE(Fiesta,2+MATCH(H9,Fiestas,0))),\"\"),\"\")","v":""},{"$f":"H9+1","v":"2010-08-05"},{"$f":"IF(ISNUMBER(J9),IFERROR(INDIRECT(CONCATENATE(Fiesta,2+MATCH(J9,Fiestas,0))),\"\"),\"\")","v":""},{"$f":"J9+1","v":"2010-08-06"},{"$f":"IF(ISNUMBER(L9),IFERROR(INDIRECT(CONCATENATE(Fiesta,2+MATCH(L9,Fiestas,0))),\"\"),\"\")","v":""},{"$f":"L9+1","v":"2010-08-07"},{"$f":"IF(ISNUMBER(N9),IFERROR(INDIRECT(CONCATENATE(Fiesta,2+MATCH(N9,Fiestas,0))),\"\"),\"\")","v":""},{"$f":"N9+1","v":"2010-08-08"},{"$f":"IF(ISNUMBER(P9),IFERROR(INDIRECT(CONCATENATE(Fiesta,2+MATCH(P9,Fiestas,0))),\"\"),\"\")","v":""},{"$f":"WEEKNUM(D9,2)","v":32}]
[null,{"$f":"IF(ISNUMBER(B9),IFERROR(INDIRECT(CONCATENATE(Evento,1+MATCH(B9,Eventos,0))),\"\"),\"\")","v":""},null,{"$f":"IF(ISNUMBER(D9),IFERROR(INDIRECT(CONCATENATE(Evento,1+MATCH(D9,Eventos,0))),\"\"),\"\")","v":""},null,{"$f":"IF(ISNUMBER(F9),IFERROR(INDIRECT(CONCATENATE(Evento,1+MATCH(F9,Eventos,0))),\"\"),\"\")","v":""},null,{"$f":"IF(ISNUMBER(H9),IFERROR(INDIRECT(CONCATENATE(Evento,1+MATCH(H9,Eventos,0))),\"\"),\"\")","v":""},null,{"$f":"IF(ISNUMBER(J9),IFERROR(INDIRECT(CONCATENATE(Evento,1+MATCH(J9,Eventos,0))),\"\"),\"\")","v":""},null,{"$f":"IF(ISNUMBER(L9),IFERROR(INDIRECT(CONCATENATE(Evento,1+MATCH(L9,Eventos,0))),\"\"),\"\")","v":""},null,{"$f":"IF(ISNUMBER(N9),IFERROR(INDIRECT(CONCATENATE(Evento,1+MATCH(N9,Eventos,0))),\"\"),\"\")","v":""},null,{"$f":"IF(ISNUMBER(P9),IFERROR(INDIRECT(CONCATENATE(Evento,1+MATCH(P9,Eventos,0))),\"\"),\"\")","v":""}]
[null,{"$f":"IF(ISNUMBER(B9),IFERROR(INDIRECT(CONCATENATE(Agenda,1+MATCH(B9,Agendas,0))),\"\"),\"\")","v":""},null,{"$f":"IF(ISNUMBER(D9),IFERROR(INDIRECT(CONCATENATE(Agenda,1+MATCH(D9,Agendas,0))),\"\"),\"\")","v":""},null,{"$f":"IF(ISNUMBER(F9),IFERROR(INDIRECT(CONCATENATE(Agenda,1+MATCH(F9,Agendas,0))),\"\"),\"\")","v":""},null,{"$f":"IF(ISNUMBER(H9),IFERROR(INDIRECT(CONCATENATE(Agenda,1+MATCH(H9,Agendas,0))),\"\"),\"\")","v":""},null,{"$f":"IF(ISNUMBER(J9),IFERROR(INDIRECT(CONCATENATE(Agenda,1+MATCH(J9,Agendas,0))),\"\"),\"\")","v":""},null,{"$f":"IF(ISNUMBER(L9),IFERROR(INDIRECT(CONCATENATE(Agenda,1+MATCH(L9,Agendas,0))),\"\"),\"\")","v":""},null,{"$f":"IF(ISNUMBER(N9),IFERROR(INDIRECT(CONCATENATE(Agenda,1+MATCH(N9,Agendas,0))),\"\"),\"\")","v":""},null,{"$f":"IF(ISNUMBER(P9),IFERROR(INDIRECT(CONCATENATE(Agenda,1+MATCH(P9,Agendas,0))),\"\"),\"\")","v":""}]
[]
[]
[]
[{"$f":"WEEKNUM(B15,1)","v":33},{"$f":"P9","v":"2010-08-08"},{"$f":"IF(ISNUMBER(B15),IFERROR(INDIRECT(CONCATENATE(Fiesta,2+MATCH(B15,Fiestas,0))),\"\"),\"\")","v":""},{"$f":"P9+1","v":"2010-08-09"},{"$f":"IF(ISNUMBER(D15),IFERROR(INDIRECT(CONCATENATE(Fiesta,2+MATCH(D15,Fiestas,0))),\"\"),\"\")","v":""},{"$f":"D15+1","v":"2010-08-10"},{"$f":"IF(ISNUMBER(F15),IFERROR(INDIRECT(CONCATENATE(Fiesta,2+MATCH(F15,Fiestas,0))),\"\"),\"\")","v":""},{"$f":"F15+1","v":"2010-08-11"},{"$f":"IF(ISNUMBER(H15),IFERROR(INDIRECT(CONCATENATE(Fiesta,2+MATCH(H15,Fiestas,0))),\"\"),\"\")","v":""},{"$f":"H15+1","v":"2010-08-12"},{"$f":"IF(ISNUMBER(J15),IFERROR(INDIRECT(CONCATENATE(Fiesta,2+MATCH(J15,Fiestas,0))),\"\"),\"\")","v":""},{"$f":"J15+1","v":"2010-08-13"},{"$f":"IF(ISNUMBER(L15),IFERROR(INDIRECT(CONCATENATE(Fiesta,2+MATCH(L15,Fiestas,0))),\"\"),\"\")","v":""},{"$f":"L15+1","v":"2010-08-14"},{"$f":"IF(ISNUMBER(N15),IFERROR(INDIRECT(CONCATENATE(Fiesta,2+MATCH(N15,Fiestas,0))),\"\"),\"\")","v":""},{"$f":"N15+1","v":"2010-08-15"},{"$f":"IF(ISNUMBER(P15),IFERROR(INDIRECT(CONCATENATE(Fiesta,2+MATCH(P15,Fiestas,0))),\"\"),\"\")","v":""},{"$f":"WEEKNUM(D15,2)","v":33}]
[null,{"$f":"IF(ISNUMBER(B15),IFERROR(INDIRECT(CONCATENATE(Evento,1+MATCH(B15,Eventos,0))),\"\"),\"\")","v":""},null,{"$f":"IF(ISNUMBER(D15),IFERROR(INDIRECT(CONCATENATE(Evento,1+MATCH(D15,Eventos,0))),\"\"),\"\")","v":"International Day of the World's Indigenous People"},null,{"$f":"IF(ISNUMBER(F15),IFERROR(INDIRECT(CONCATENATE(Evento,1+MATCH(F15,Eventos,0))),\"\"),\"\")","v":""},null,{"$f":"IF(ISNUMBER(H15),IFERROR(INDIRECT(CONCATENATE(Evento,1+MATCH(H15,Eventos,0))),\"\"),\"\")","v":""},null,{"$f":"IF(ISNUMBER(J15),IFERROR(INDIRECT(CONCATENATE(Evento,1+MATCH(J15,Eventos,0))),\"\"),\"\")","v":""},null,{"$f":"IF(ISNUMBER(L15),IFERROR(INDIRECT(CONCATENATE(Evento,1+MATCH(L15,Eventos,0))),\"\"),\"\")","v":""},null,{"$f":"IF(ISNUMBER(N15),IFERROR(INDIRECT(CONCATENATE(Evento,1+MATCH(N15,Eventos,0))),\"\"),\"\")","v":""},null,{"$f":"IF(ISNUMBER(P15),IFERROR(INDIRECT(CONCATENATE(Evento,1+MATCH(P15,Eventos,0))),\"\"),\"\")","v":""}]
[null,{"$f":"IF(ISNUMBER(B15),IFERROR(INDIRECT(CONCATENATE(Agenda,1+MATCH(B15,Agendas,0))),\"\"),\"\")","v":""},null,{"$f":"IF(ISNUMBER(D15),IFERROR(INDIRECT(CONCATENATE(Agenda,1+MATCH(D15,Agendas,0))),\"\"),\"\")","v":""},null,{"$f":"IF(ISNUMBER(F15),IFERROR(INDIRECT(CONCATENATE(Agenda,1+MATCH(F15,Agendas,0))),\"\"),\"\")","v":""},null,{"$f":"IF(ISNUMBER(H15),IFERROR(INDIRECT(CONCATENATE(Agenda,1+MATCH(H15,Agendas,0))),\"\"),\"\")","v":""},null,{"$f":"IF(ISNUMBER(J15),IFERROR(INDIRECT(CONCATENATE(Agenda,1+MATCH(J15,Agendas,0))),\"\"),\"\")","v":""},null,{"$f":"IF(ISNUMBER(L15),IFERROR(INDIRECT(CONCATENATE(Agenda,1+MATCH(L15,Agendas,0))),\"\"),\"\")","v":""},null,{"$f":"IF(ISNUMBER(N15),IFERROR(INDIRECT(CONCATENATE(Agenda,1+MATCH(N15,Agendas,0))),\"\"),\"\")","v":""},null,{"$f":"IF(ISNUMBER(P15),IFERROR(INDIRECT(CONCATENATE(Agenda,1+MATCH(P15,Agendas,0))),\"\"),\"\")","v":""}]
[]
[]
[]
[{"$f":"WEEKNUM(B21,1)","v":34},{"$f":"P15","v":"2010-08-15"},{"$f":"IF(ISNUMBER(B21),IFERROR(INDIRECT(CONCATENATE(Fiesta,2+MATCH(B21,Fiestas,0))),\"\"),\"\")","v":""},{"$f":"P15+1","v":"2010-08-16"},{"$f":"IF(ISNUMBER(D21),IFERROR(INDIRECT(CONCATENATE(Fiesta,2+MATCH(D21,Fiestas,0))),\"\"),\"\")","v":""},{"$f":"D21+1","v":"2010-08-17"},{"$f":"IF(ISNUMBER(F21),IFERROR(INDIRECT(CONCATENATE(Fiesta,2+MATCH(F21,Fiestas,0))),\"\"),\"\")","v":""},{"$f":"F21+1","v":"2010-08-18"},{"$f":"IF(ISNUMBER(H21),IFERROR(INDIRECT(CONCATENATE(Fiesta,2+MATCH(H21,Fiestas,0))),\"\"),\"\")","v":""},{"$f":"H21+1","v":"2010-08-19"},{"$f":"IF(ISNUMBER(J21),IFERROR(INDIRECT(CONCATENATE(Fiesta,2+MATCH(J21,Fiestas,0))),\"\"),\"\")","v":""},{"$f":"J21+1","v":"2010-08-20"},{"$f":"IF(ISNUMBER(L21),IFERROR(INDIRECT(CONCATENATE(Fiesta,2+MATCH(L21,Fiestas,0))),\"\"),\"\")","v":""},{"$f":"L21+1","v":"2010-08-21"},{"$f":"IF(ISNUMBER(N21),IFERROR(INDIRECT(CONCATENATE(Fiesta,2+MATCH(N21,Fiestas,0))),\"\"),\"\")","v":""},{"$f":"N21+1","v":"2010-08-22"},{"$f":"IF(ISNUMBER(P21),IFERROR(INDIRECT(CONCATENATE(Fiesta,2+MATCH(P21,Fiestas,0))),\"\"),\"\")","v":""},{"$f":"WEEKNUM(D21,2)","v":34}]
[null,{"$f":"IF(ISNUMBER(B21),IFERROR(INDIRECT(CONCATENATE(Evento,1+MATCH(B21,Eventos,0))),\"\"),\"\")","v":""},null,{"$f":"IF(ISNUMBER(D21),IFERROR(INDIRECT(CONCATENATE(Evento,1+MATCH(D21,Eventos,0))),\"\"),\"\")","v":""},null,{"$f":"IF(ISNUMBER(F21),IFERROR(INDIRECT(CONCATENATE(Evento,1+MATCH(F21,Eventos,0))),\"\"),\"\")","v":""},null,{"$f":"IF(ISNUMBER(H21),IFERROR(INDIRECT(CONCATENATE(Evento,1+MATCH(H21,Eventos,0))),\"\"),\"\")","v":""},null,{"$f":"IF(ISNUMBER(J21),IFERROR(INDIRECT(CONCATENATE(Evento,1+MATCH(J21,Eventos,0))),\"\"),\"\")","v":"World Humanitarian Day"},null,{"$f":"IF(ISNUMBER(L21),IFERROR(INDIRECT(CONCATENATE(Evento,1+MATCH(L21,Eventos,0))),\"\"),\"\")","v":""},null,{"$f":"IF(ISNUMBER(N21),IFERROR(INDIRECT(CONCATENATE(Evento,1+MATCH(N21,Eventos,0))),\"\"),\"\")","v":""},null,{"$f":"IF(ISNUMBER(P21),IFERROR(INDIRECT(CONCATENATE(Evento,1+MATCH(P21,Eventos,0))),\"\"),\"\")","v":""}]
[null,{"$f":"IF(ISNUMBER(B21),IFERROR(INDIRECT(CONCATENATE(Agenda,1+MATCH(B21,Agendas,0))),\"\"),\"\")","v":""},null,{"$f":"IF(ISNUMBER(D21),IFERROR(INDIRECT(CONCATENATE(Agenda,1+MATCH(D21,Agendas,0))),\"\"),\"\")","v":""},null,{"$f":"IF(ISNUMBER(F21),IFERROR(INDIRECT(CONCATENATE(Agenda,1+MATCH(F21,Agendas,0))),\"\"),\"\")","v":""},null,{"$f":"IF(ISNUMBER(H21),IFERROR(INDIRECT(CONCATENATE(Agenda,1+MATCH(H21,Agendas,0))),\"\"),\"\")","v":""},null,{"$f":"IF(ISNUMBER(J21),IFERROR(INDIRECT(CONCATENATE(Agenda,1+MATCH(J21,Agendas,0))),\"\"),\"\")","v":""},null,{"$f":"IF(ISNUMBER(L21),IFERROR(INDIRECT(CONCATENATE(Agenda,1+MATCH(L21,Agendas,0))),\"\"),\"\")","v":""},null,{"$f":"IF(ISNUMBER(N21),IFERROR(INDIRECT(CONCATENATE(Agenda,1+MATCH(N21,Agendas,0))),\"\"),\"\")","v":""},null,{"$f":"IF(ISNUMBER(P21),IFERROR(INDIRECT(CONCATENATE(Agenda,1+MATCH(P21,Agendas,0))),\"\"),\"\")","v":""}]
[]
[]
[]
[{"$f":"IF(B27=\"\",\"\",WEEKNUM(B27,1))","v":35},{"$f":"P21","v":"2010-08-22"},{"$f":"IF(ISNUMBER(B27),IFERROR(INDIRECT(CONCATENATE(Fiesta,2+MATCH(B27,Fiestas,0))),\"\"),\"\")","v":""},{"$f":"IF(P21<EOMONTH($D$1,0),P21+1,\"\")","v":"2010-08-23"},{"$f":"IF(ISNUMBER(D27),IFERROR(INDIRECT(CONCATENATE(Fiesta,2+MATCH(D27,Fiestas,0))),\"\"),\"\")","v":""},{"$f":"IF(D27<EOMONTH($D$1,0),D27+1,\"\")","v":"2010-08-24"},{"$f":"IF(ISNUMBER(F27),IFERROR(INDIRECT(CONCATENATE(Fiesta,2+MATCH(F27,Fiestas,0))),\"\"),\"\")","v":""},{"$f":"IF(F27<EOMONTH($D$1,0),F27+1,\"\")","v":"2010-08-25"},{"$f":"IF(ISNUMBER(H27),IFERROR(INDIRECT(CONCATENATE(Fiesta,2+MATCH(H27,Fiestas,0))),\"\"),\"\")","v":""},{"$f":"IF(H27<EOMONTH($D$1,0),H27+1,\"\")","v":"2010-08-26"},{"$f":"IF(ISNUMBER(J27),IFERROR(INDIRECT(CONCATENATE(Fiesta,2+MATCH(J27,Fiestas,0))),\"\"),\"\")","v":""},{"$f":"IF(J27<EOMONTH($D$1,0),J27+1,\"\")","v":"2010-08-27"},{"$f":"IF(ISNUMBER(L27),IFERROR(INDIRECT(CONCATENATE(Fiesta,2+MATCH(L27,Fiestas,0))),\"\"),\"\")","v":""},{"$f":"IF(L27<EOMONTH($D$1,0),L27+1,\"\")","v":"2010-08-28"},{"$f":"IF(ISNUMBER(N27),IFERROR(INDIRECT(CONCATENATE(Fiesta,2+MATCH(N27,Fiestas,0))),\"\"),\"\")","v":""},{"$f":"IF(N27<EOMONTH($D$1,0),N27+1,\"\")","v":"2010-08-29"},{"$f":"IF(ISNUMBER(P27),IFERROR(INDIRECT(CONCATENATE(Fiesta,2+MATCH(P27,Fiestas,0))),\"\"),\"\")","v":""},{"$f":"IF(D27=\"\",\"\",WEEKNUM(D27,2))","v":35}]
[null,{"$f":"IF(ISNUMBER(B27),IFERROR(INDIRECT(CONCATENATE(Evento,1+MATCH(B27,Eventos,0))),\"\"),\"\")","v":""},null,{"$f":"IF(ISNUMBER(D27),IFERROR(INDIRECT(CONCATENATE(Evento,1+MATCH(D27,Eventos,0))),\"\"),\"\")","v":""},null,{"$f":"IF(ISNUMBER(F27),IFERROR(INDIRECT(CONCATENATE(Evento,1+MATCH(F27,Eventos,0))),\"\"),\"\")","v":""},null,{"$f":"IF(ISNUMBER(H27),IFERROR(INDIRECT(CONCATENATE(Evento,1+MATCH(H27,Eventos,0))),\"\"),\"\")","v":""},null,{"$f":"IF(ISNUMBER(J27),IFERROR(INDIRECT(CONCATENATE(Evento,1+MATCH(J27,Eventos,0))),\"\"),\"\")","v":""},null,{"$f":"IF(ISNUMBER(L27),IFERROR(INDIRECT(CONCATENATE(Evento,1+MATCH(L27,Eventos,0))),\"\"),\"\")","v":""},null,{"$f":"IF(ISNUMBER(N27),IFERROR(INDIRECT(CONCATENATE(Evento,1+MATCH(N27,Eventos,0))),\"\"),\"\")","v":""},null,{"$f":"IF(ISNUMBER(P27),IFERROR(INDIRECT(CONCATENATE(Evento,1+MATCH(P27,Eventos,0))),\"\"),\"\")","v":""}]
[null,{"$f":"IF(ISNUMBER(B27),IFERROR(INDIRECT(CONCATENATE(Agenda,1+MATCH(B27,Agendas,0))),\"\"),\"\")","v":""},null,{"$f":"IF(ISNUMBER(D27),IFERROR(INDIRECT(CONCATENATE(Agenda,1+MATCH(D27,Agendas,0))),\"\"),\"\")","v":""},null,{"$f":"IF(ISNUMBER(F27),IFERROR(INDIRECT(CONCATENATE(Agenda,1+MATCH(F27,Agendas,0))),\"\"),\"\")","v":""},null,{"$f":"IF(ISNUMBER(H27),IFERROR(INDIRECT(CONCATENATE(Agenda,1+MATCH(H27,Agendas,0))),\"\"),\"\")","v":""},null,{"$f":"IF(ISNUMBER(J27),IFERROR(INDIRECT(CONCATENATE(Agenda,1+MATCH(J27,Agendas,0))),\"\"),\"\")","v":""},null,{"$f":"IF(ISNUMBER(L27),IFERROR(INDIRECT(CONCATENATE(Agenda,1+MATCH(L27,Agendas,0))),\"\"),\"\")","v":""},null,{"$f":"IF(ISNUMBER(N27),IFERROR(INDIRECT(CONCATENATE(Agenda,1+MATCH(N27,Agendas,0))),\"\"),\"\")","v":""},null,{"$f":"IF(ISNUMBER(P27),IFERROR(INDIRECT(CONCATENATE(Agenda,1+MATCH(P27,Agendas,0))),\"\"),\"\")","v":""}]
[]
[]
[]
[{"$f":"IF(B33=\"\",\"\",WEEKNUM(B33,1))","v":36},{"$f":"P27","v":"2010-08-29"},{"$f":"IF(ISNUMBER(B33),IFERROR(INDIRECT(CONCATENATE(Fiesta,2+MATCH(B33,Fiestas,0))),\"\"),\"\")","v":""},{"$f":"IF(P27<EOMONTH($D$1,0),P27+1,\"\")","v":"2010-08-30"},{"$f":"IF(ISNUMBER(D33),IFERROR(INDIRECT(CONCATENATE(Fiesta,2+MATCH(D33,Fiestas,0))),\"\"),\"\")","v":""},{"$f":"IF(D33<EOMONTH($D$1,0),D33+1,\"\")","v":"2010-08-31"},{"$f":"IF(ISNUMBER(F33),IFERROR(INDIRECT(CONCATENATE(Fiesta,2+MATCH(F33,Fiestas,0))),\"\"),\"\")","v":""},"Notes:",null,null,null,null,null,null,null,null,null,{"$f":"IF(D33=\"\",\"\",WEEKNUM(D33,2))","v":36}]
[null,{"$f":"IF(ISNUMBER(B33),IFERROR(INDIRECT(CONCATENATE(Evento,1+MATCH(B33,Eventos,0))),\"\"),\"\")","v":""},null,{"$f":"IF(ISNUMBER(D33),IFERROR(INDIRECT(CONCATENATE(Evento,1+MATCH(D33,Eventos,0))),\"\"),\"\")","v":""},null,{"$f":"IF(ISNUMBER(F33),IFERROR(INDIRECT(CONCATENATE(Evento,1+MATCH(F33,Eventos,0))),\"\"),\"\")","v":""}]
[null,{"$f":"IF(ISNUMBER(B33),IFERROR(INDIRECT(CONCATENATE(Agenda,1+MATCH(B33,Agendas,0))),\"\"),\"\")","v":""},null,{"$f":"IF(ISNUMBER(D33),IFERROR(INDIRECT(CONCATENATE(Agenda,1+MATCH(D33,Agendas,0))),\"\"),\"\")","v":""},null,{"$f":"IF(ISNUMBER(F33),IFERROR(INDIRECT(CONCATENATE(Agenda,1+MATCH(F33,Agendas,0))),\"\"),\"\")","v":""}]

{"sheet":"Sep","index":12,"n_rows":35,"n_cols":18,"rows_kept":35,"cut":false,"hidden":false,"merged":[[36,7,36,8],[36,9,36,10],[36,11,36,12],[37,7,37,8],[37,9,37,10],[37,11,37,12],[36,13,36,16],[37,13,37,16],[34,7,34,8],[34,9,34,10],[34,11,34,12],[34,13,34,14],[34,15,34,16],[35,7,35,8],[35,9,35,10],[35,11,35,12],[35,13,35,14],[35,15,35,16],[37,1,37,2],[37,3,37,4],[37,5,37,6],[36,1,36,2],[36,3,36,4],[36,5,36,6],[35,1,35,2],[35,3,35,4],[35,5,35,6],[34,1,34,2],[34,3,34,4],[34,5,34,6],[31,11,31,12],[31,13,31,14],[31,15,31,16],[33,1,33,2],[33,3,33,4],[33,5,33,6],[31,1,31,2],[31,3,31,4],[31,5,31,6],[31,7,31,8],[31,9,31,10],[32,7,32,8],[32,9,32,10],[32,11,32,12],[32,13,32,14],[32,15,32,16],[33,7,33,8],[33,9,33,10],[33,11,33,12],[33,13,33,14],[33,15,33,16],[29,11,29,12],[29,13,29,14],[29,15,29,16],[30,1,30,2],[30,3,30,4],[30,5,30,6],[30,7,30,8],[30,9,30,10],[30,11,30,12],[30,13,30,14],[30,15,30,16],[29,1,29,2],[29,3,29,4],[29,5,29,6],[29,7,29,8],[29,9,29,10],[27,11,27,12],[27,13,27,14],[27,15,27,16],[28,1,28,2],[28,3,28,4],[28,5,28,6],[28,7,28,8],[28,9,28,10],[28,11,28,12],[28,13,28,14],[28,15,28,16],[27,1,27,2],[27,3,27,4],[27,5,27,6],[27,7,27,8],[27,9,27,10],[24,11,24,12],[24,13,24,14],[24,15,24,16],[25,1,25,2],[25,3,25,4],[25,5,25,6],[25,7,25,8],[25,9,25,10],[25,11,25,12],[25,13,25,14],[25,15,25,16],[24,1,24,2],[24,3,24,4],[24,5,24,6],[24,7,24,8],[24,9,24,10],[22,11,22,12],[22,13,22,14],[22,15,22,16],[23,1,23,2],[23,3,23,4],[23,5,23,6],[23,7,23,8],[23,9,23,10],[23,11,23,12],[23,13,23,14],[23,15,23,16],[22,1,22,2],[22,3,22,4],[22,5,22,6],[22,7,22,8],[22,9,22,10],[19,11,19,12],[19,13,19,14],[19,15,19,16],[21,1,21,2],[21,3,21,4],[21,5,21,6],[21,7,21,8],[21,9,21,10],[21,11,21,12],[21,13,21,14],[21,15,21,16],[19,1,19,2],[19,3,19,4],[19,5,19,6],[19,7,19,8],[19,9,19,10],[17,11,17,12],[17,13,17,14],[17,15,17,16],[18,1,18,2],[18,3,18,4],[18,5,18,6],[18,7,18,8],[18,9,18,10],[18,11,18,12],[18,13,18,14],[18,15,18,16],[17,1,17,2],[17,3,17,4],[17,5,17,6],[17,7,17,8],[17,9,17,10],[15,11,15,12],[15,13,15,14],[15,15,15,16],[16,1,16,2],[16,3,16,4],[16,5,16,6],[16,7,16,8],[16,9,16,10],[16,11,16,12],[16,13,16,14],[16,15,16,16],[15,1,15,2],[15,3,15,4],[15,5,15,6],[15,7,15,8],[15,9,15,10],[12,11,12,12],[12,13,12,14],[12,15,12,16],[13,1,13,2],[13,3,13,4],[13,5,13,6],[13,7,13,8],[13,9,13,10],[13,11,13,12],[13,13,13,14],[13,15,13,16],[12,1,12,2],[12,3,12,4],[12,5,12,6],[12,7,12,8],[12,9,12,10],[10,11,10,12],[10,13,10,14],[10,15,10,16],[11,1,11,2],[11,3,11,4],[11,5,11,6],[11,7,11,8],[11,9,11,10],[11,11,11,12],[11,13,11,14],[11,15,11,16],[10,1,10,2],[10,3,10,4],[10,5,10,6],[10,7,10,8],[10,9,10,10],[7,11,7,12],[7,13,7,14],[7,15,7,16],[9,1,9,2],[9,3,9,4],[9,5,9,6],[9,7,9,8],[9,9,9,10],[9,11,9,12],[9,13,9,14],[9,15,9,16],[7,1,7,2],[7,3,7,4],[7,5,7,6],[7,7,7,8],[7,9,7,10],[5,11,5,12],[5,13,5,14],[5,15,5,16],[6,1,6,2],[6,3,6,4],[6,5,6,6],[6,7,6,8],[6,9,6,10],[6,11,6,12],[6,13,6,14],[6,15,6,16],[5,1,5,2],[5,3,5,4],[5,5,5,6],[5,7,5,8],[5,9,5,10],[0,9,0,11],[1,1,1,2],[1,3,1,4],[1,5,1,6],[1,7,1,8],[1,9,1,10],[1,11,1,12],[1,13,1,14],[0,3,0,8],[1,15,1,16],[3,11,3,12],[3,13,3,14],[3,15,3,16],[4,1,4,2],[4,3,4,4],[4,5,4,6],[4,7,4,8],[4,9,4,10],[4,11,4,12],[4,13,4,14],[4,15,4,16],[3,1,3,2],[3,3,3,4],[3,5,3,6],[3,7,3,8],[3,9,3,10]]}
[null,null,null,{"$f":"DATE(Cal!M3,9,1)","v":"2010-09-01"},null,null,null,null,null,{"$f":"Cal!$M$3","v":2010}]
[null,{"$f":"DATE(2010,2,7)","v":"2010-02-07"},null,{"$f":"DATE(2010,2,1)","v":"2010-02-01"},null,{"$f":"DATE(2010,2,2)","v":"2010-02-02"},null,{"$f":"DATE(2010,2,3)","v":"2010-02-03"},null,{"$f":"DATE(2010,2,4)","v":"2010-02-04"},null,{"$f":"DATE(2010,2,5)","v":"2010-02-05"},null,{"$f":"DATE(2010,2,6)","v":"2010-02-06"},null,{"$f":"DATE(2010,2,7)","v":"2010-02-07"}]
[{"$f":"IF(N3=\"\",\"\",WEEKNUM(N3,1))","v":36},null,{"$f":"IF(ISNUMBER(B3),IFERROR(INDIRECT(CONCATENATE(Fiesta,2+MATCH(B3,Fiestas,0))),\"\"),\"\")","v":""},{"$f":"IF(WEEKDAY($D$1)=2,$D$1,\"\")","v":""},{"$f":"IF(ISNUMBER(D3),IFERROR(INDIRECT(CONCATENATE(Fiesta,2+MATCH(D3,Fiestas,0))),\"\"),\"\")","v":""},{"$f":"IF(D3<>\"\",D3+1,IF(WEEKDAY($D$1)=3,$D$1,\"\"))","v":""},{"$f":"IF(ISNUMBER(F3),IFERROR(INDIRECT(CONCATENATE(Fiesta,2+MATCH(F3,Fiestas,0))),\"\"),\"\")","v":""},{"$f":"IF(F3<>\"\",F3+1,IF(WEEKDAY($D$1)=4,$D$1,\"\"))","v":"2010-09-01"},{"$f":"IF(ISNUMBER(H3),IFERROR(INDIRECT(CONCATENATE(Fiesta,2+MATCH(H3,Fiestas,0))),\"\"),\"\")","v":""},{"$f":"IF(H3<>\"\",H3+1,IF(WEEKDAY($D$1)=5,$D$1,\"\"))","v":"2010-09-02"},{"$f":"IF(ISNUMBER(J3),IFERROR(INDIRECT(CONCATENATE(Fiesta,2+MATCH(J3,Fiestas,0))),\"\"),\"\")","v":""},{"$f":"IF(J3<>\"\",J3+1,IF(WEEKDAY($D$1)=6,$D$1,\"\"))","v":"2010-09-03"},{"$f":"IF(ISNUMBER(L3),IFERROR(INDIRECT(CONCATENATE(Fiesta,2+MATCH(L3,Fiestas,0))),\"\"),\"\")","v":""},{"$f":"IF(L3<>\"\",L3+1,IF(WEEKDAY($D$1)=7,$D$1,\"\"))","v":"2010-09-04"},{"$f":"IF(ISNUMBER(N3),IFERROR(INDIRECT(CONCATENATE(Fiesta,2+MATCH(N3,Fiestas,0))),\"\"),\"\")","v":""},{"$f":"IF(N3<>\"\",N3+1,IF(WEEKDAY($D$1)=1,$D$1,\"\"))","v":"2010-09-05"},{"$f":"IF(ISNUMBER(P3),IFERROR(INDIRECT(CONCATENATE(Fiesta,2+MATCH(P3,Fiestas,0))),\"\"),\"\")","v":""},{"$f":"IF(P3=\"\",\"\",WEEKNUM(P3,2))","v":36}]
[null,{"$f":"IF(ISNUMBER(B3),IFERROR(INDIRECT(CONCATENATE(Evento,1+MATCH(B3,Eventos,0))),\"\"),\"\")","v":""},null,{"$f":"IF(ISNUMBER(D3),IFERROR(INDIRECT(CONCATENATE(Evento,1+MATCH(D3,Eventos,0))),\"\"),\"\")","v":""},null,{"$f":"IF(ISNUMBER(F3),IFERROR(INDIRECT(CONCATENATE(Evento,1+MATCH(F3,Eventos,0))),\"\"),\"\")","v":""},null,{"$f":"IF(ISNUMBER(H3),IFERROR(INDIRECT(CONCATENATE(Evento,1+MATCH(H3,Eventos,0))),\"\"),\"\")","v":""},null,{"$f":"IF(ISNUMBER(J3),IFERROR(INDIRECT(CONCATENATE(Evento,1+MATCH(J3,Eventos,0))),\"\"),\"\")","v":""},null,{"$f":"IF(ISNUMBER(L3),IFERROR(INDIRECT(CONCATENATE(Evento,1+MATCH(L3,Eventos,0))),\"\"),\"\")","v":""},null,{"$f":"IF(ISNUMBER(N3),IFERROR(INDIRECT(CONCATENATE(Evento,1+MATCH(N3,Eventos,0))),\"\"),\"\")","v":""},null,{"$f":"IF(ISNUMBER(P3),IFERROR(INDIRECT(CONCATENATE(Evento,1+MATCH(P3,Eventos,0))),\"\"),\"\")","v":""}]
[null,{"$f":"IF(ISNUMBER(B3),IFERROR(INDIRECT(CONCATENATE(Agenda,1+MATCH(B3,Agendas,0))),\"\"),\"\")","v":""},null,{"$f":"IF(ISNUMBER(D3),IFERROR(INDIRECT(CONCATENATE(Agenda,1+MATCH(D3,Agendas,0))),\"\"),\"\")","v":""},null,{"$f":"IF(ISNUMBER(F3),IFERROR(INDIRECT(CONCATENATE(Agenda,1+MATCH(F3,Agendas,0))),\"\"),\"\")","v":""},null,{"$f":"IF(ISNUMBER(H3),IFERROR(INDIRECT(CONCATENATE(Agenda,1+MATCH(H3,Agendas,0))),\"\"),\"\")","v":""},null,{"$f":"IF(ISNUMBER(J3),IFERROR(INDIRECT(CONCATENATE(Agenda,1+MATCH(J3,Agendas,0))),\"\"),\"\")","v":""},null,{"$f":"IF(ISNUMBER(L3),IFERROR(INDIRECT(CONCATENATE(Agenda,1+MATCH(L3,Agendas,0))),\"\"),\"\")","v":""},null,{"$f":"IF(ISNUMBER(N3),IFERROR(INDIRECT(CONCATENATE(Agenda,1+MATCH(N3,Agendas,0))),\"\"),\"\")","v":""},null,{"$f":"IF(ISNUMBER(P3),IFERROR(INDIRECT(CONCATENATE(Agenda,1+MATCH(P3,Agendas,0))),\"\"),\"\")","v":""}]
[]
[]
[]
[{"$f":"WEEKNUM(B9,1)","v":37},{"$f":"P3","v":"2010-09-05"},{"$f":"IF(ISNUMBER(B9),IFERROR(INDIRECT(CONCATENATE(Fiesta,2+MATCH(B9,Fiestas,0))),\"\"),\"\")","v":""},{"$f":"P3+1","v":"2010-09-06"},{"$f":"IF(ISNUMBER(D9),IFERROR(INDIRECT(CONCATENATE(Fiesta,2+MATCH(D9,Fiestas,0))),\"\"),\"\")","v":"Labor Day"},{"$f":"D9+1","v":"2010-09-07"},{"$f":"IF(ISNUMBER(F9),IFERROR(INDIRECT(CONCATENATE(Fiesta,2+MATCH(F9,Fiestas,0))),\"\"),\"\")","v":""},{"$f":"F9+1","v":"2010-09-08"},{"$f":"IF(ISNUMBER(H9),IFERROR(INDIRECT(CONCATENATE(Fiesta,2+MATCH(H9,Fiestas,0))),\"\"),\"\")","v":""},{"$f":"H9+1","v":"2010-09-09"},{"$f":"IF(ISNUMBER(J9),IFERROR(INDIRECT(CONCATENATE(Fiesta,2+MATCH(J9,Fiestas,0))),\"\"),\"\")","v":""},{"$f":"J9+1","v":"2010-09-10"},{"$f":"IF(ISNUMBER(L9),IFERROR(INDIRECT(CONCATENATE(Fiesta,2+MATCH(L9,Fiestas,0))),\"\"),\"\")","v":""},{"$f":"L9+1","v":"2010-09-11"},{"$f":"IF(ISNUMBER(N9),IFERROR(INDIRECT(CONCATENATE(Fiesta,2+MATCH(N9,Fiestas,0))),\"\"),\"\")","v":""},{"$f":"N9+1","v":"2010-09-12"},{"$f":"IF(ISNUMBER(P9),IFERROR(INDIRECT(CONCATENATE(Fiesta,2+MATCH(P9,Fiestas,0))),\"\"),\"\")","v":""},{"$f":"WEEKNUM(D9,2)","v":37}]
[null,{"$f":"IF(ISNUMBER(B9),IFERROR(INDIRECT(CONCATENATE(Evento,1+MATCH(B9,Eventos,0))),\"\"),\"\")","v":""},null,{"$f":"IF(ISNUMBER(D9),IFERROR(INDIRECT(CONCATENATE(Evento,1+MATCH(D9,Eventos,0))),\"\"),\"\")","v":""},null,{"$f":"IF(ISNUMBER(F9),IFERROR(INDIRECT(CONCATENATE(Evento,1+MATCH(F9,Eventos,0))),\"\"),\"\")","v":""},null,{"$f":"IF(ISNUMBER(H9),IFERROR(INDIRECT(CONCATENATE(Evento,1+MATCH(H9,Eventos,0))),\"\"),\"\")","v":"International Literacy Day"},null,{"$f":"IF(ISNUMBER(J9),IFERROR(INDIRECT(CONCATENATE(Evento,1+MATCH(J9,Eventos,0))),\"\"),\"\")","v":""},null,{"$f":"IF(ISNUMBER(L9),IFERROR(INDIRECT(CONCATENATE(Evento,1+MATCH(L9,Eventos,0))),\"\"),\"\")","v":""},null,{"$f":"IF(ISNUMBER(N9),IFERROR(INDIRECT(CONCATENATE(Evento,1+MATCH(N9,Eventos,0))),\"\"),\"\")","v":"World First Aid Day"},null,{"$f":"IF(ISNUMBER(P9),IFERROR(INDIRECT(CONCATENATE(Evento,1+MATCH(P9,Eventos,0))),\"\"),\"\")","v":""}]
[null,{"$f":"IF(ISNUMBER(B9),IFERROR(INDIRECT(CONCATENATE(Agenda,1+MATCH(B9,Agendas,0))),\"\"),\"\")","v":""},null,{"$f":"IF(ISNUMBER(D9),IFERROR(INDIRECT(CONCATENATE(Agenda,1+MATCH(D9,Agendas,0))),\"\"),\"\")","v":""},null,{"$f":"IF(ISNUMBER(F9),IFERROR(INDIRECT(CONCATENATE(Agenda,1+MATCH(F9,Agendas,0))),\"\"),\"\")","v":""},null,{"$f":"IF(ISNUMBER(H9),IFERROR(INDIRECT(CONCATENATE(Agenda,1+MATCH(H9,Agendas,0))),\"\"),\"\")","v":""},null,{"$f":"IF(ISNUMBER(J9),IFERROR(INDIRECT(CONCATENATE(Agenda,1+MATCH(J9,Agendas,0))),\"\"),\"\")","v":""},null,{"$f":"IF(ISNUMBER(L9),IFERROR(INDIRECT(CONCATENATE(Agenda,1+MATCH(L9,Agendas,0))),\"\"),\"\")","v":""},null,{"$f":"IF(ISNUMBER(N9),IFERROR(INDIRECT(CONCATENATE(Agenda,1+MATCH(N9,Agendas,0))),\"\"),\"\")","v":""},null,{"$f":"IF(ISNUMBER(P9),IFERROR(INDIRECT(CONCATENATE(Agenda,1+MATCH(P9,Agendas,0))),\"\"),\"\")","v":""}]
[]
[]
[]
[{"$f":"WEEKNUM(B15,1)","v":38},{"$f":"P9","v":"2010-09-12"},{"$f":"IF(ISNUMBER(B15),IFERROR(INDIRECT(CONCATENATE(Fiesta,2+MATCH(B15,Fiestas,0))),\"\"),\"\")","v":""},{"$f":"P9+1","v":"2010-09-13"},{"$f":"IF(ISNUMBER(D15),IFERROR(INDIRECT(CONCATENATE(Fiesta,2+MATCH(D15,Fiestas,0))),\"\"),\"\")","v":""},{"$f":"D15+1","v":"2010-09-14"},{"$f":"IF(ISNUMBER(F15),IFERROR(INDIRECT(CONCATENATE(Fiesta,2+MATCH(F15,Fiestas,0))),\"\"),\"\")","v":""},{"$f":"F15+1","v":"2010-09-15"},{"$f":"IF(ISNUMBER(H15),IFERROR(INDIRECT(CONCATENATE(Fiesta,2+MATCH(H15,Fiestas,0))),\"\"),\"\")","v":""},{"$f":"H15+1","v":"2010-09-16"},{"$f":"IF(ISNUMBER(J15),IFERROR(INDIRECT(CONCATENATE(Fiesta,2+MATCH(J15,Fiestas,0))),\"\"),\"\")","v":""},{"$f":"J15+1","v":"2010-09-17"},{"$f":"IF(ISNUMBER(L15),IFERROR(INDIRECT(CONCATENATE(Fiesta,2+MATCH(L15,Fiestas,0))),\"\"),\"\")","v":""},{"$f":"L15+1","v":"2010-09-18"},{"$f":"IF(ISNUMBER(N15),IFERROR(INDIRECT(CONCATENATE(Fiesta,2+MATCH(N15,Fiestas,0))),\"\"),\"\")","v":""},{"$f":"N15+1","v":"2010-09-19"},{"$f":"IF(ISNUMBER(P15),IFERROR(INDIRECT(CONCATENATE(Fiesta,2+MATCH(P15,Fiestas,0))),\"\"),\"\")","v":""},{"$f":"WEEKNUM(D15,2)","v":38}]
[null,{"$f":"IF(ISNUMBER(B15),IFERROR(INDIRECT(CONCATENATE(Evento,1+MATCH(B15,Eventos,0))),\"\"),\"\")","v":""},null,{"$f":"IF(ISNUMBER(D15),IFERROR(INDIRECT(CONCATENATE(Evento,1+MATCH(D15,Eventos,0))),\"\"),\"\")","v":""},null,{"$f":"IF(ISNUMBER(F15),IFERROR(INDIRECT(CONCATENATE(Evento,1+MATCH(F15,Eventos,0))),\"\"),\"\")","v":""},null,{"$f":"IF(ISNUMBER(H15),IFERROR(INDIRECT(CONCATENATE(Evento,1+MATCH(H15,Eventos,0))),\"\"),\"\")","v":"International Day of Democracy"},null,{"$f":"IF(ISNUMBER(J15),IFERROR(INDIRECT(CONCATENATE(Evento,1+MATCH(J15,Eventos,0))),\"\"),\"\")","v":"International Day for the Preservation of the Ozone Layer"},null,{"$f":"IF(ISNUMBER(L15),IFERROR(INDIRECT(CONCATENATE(Evento,1+MATCH(L15,Eventos,0))),\"\"),\"\")","v":""},null,{"$f":"IF(ISNUMBER(N15),IFERROR(INDIRECT(CONCATENATE(Evento,1+MATCH(N15,Eventos,0))),\"\"),\"\")","v":""},null,{"$f":"IF(ISNUMBER(P15),IFERROR(INDIRECT(CONCATENATE(Evento,1+MATCH(P15,Eventos,0))),\"\"),\"\")","v":""}]
[null,{"$f":"IF(ISNUMBER(B15),IFERROR(INDIRECT(CONCATENATE(Agenda,1+MATCH(B15,Agendas,0))),\"\"),\"\")","v":""},null,{"$f":"IF(ISNUMBER(D15),IFERROR(INDIRECT(CONCATENATE(Agenda,1+MATCH(D15,Agendas,0))),\"\"),\"\")","v":""},null,{"$f":"IF(ISNUMBER(F15),IFERROR(INDIRECT(CONCATENATE(Agenda,1+MATCH(F15,Agendas,0))),\"\"),\"\")","v":""},null,{"$f":"IF(ISNUMBER(H15),IFERROR(INDIRECT(CONCATENATE(Agenda,1+MATCH(H15,Agendas,0))),\"\"),\"\")","v":""},null,{"$f":"IF(ISNUMBER(J15),IFERROR(INDIRECT(CONCATENATE(Agenda,1+MATCH(J15,Agendas,0))),\"\"),\"\")","v":""},null,{"$f":"IF(ISNUMBER(L15),IFERROR(INDIRECT(CONCATENATE(Agenda,1+MATCH(L15,Agendas,0))),\"\"),\"\")","v":""},null,{"$f":"IF(ISNUMBER(N15),IFERROR(INDIRECT(CONCATENATE(Agenda,1+MATCH(N15,Agendas,0))),\"\"),\"\")","v":""},null,{"$f":"IF(ISNUMBER(P15),IFERROR(INDIRECT(CONCATENATE(Agenda,1+MATCH(P15,Agendas,0))),\"\"),\"\")","v":""}]
[]
[]
[]
[{"$f":"WEEKNUM(B21,1)","v":39},{"$f":"P15","v":"2010-09-19"},{"$f":"IF(ISNUMBER(B21),IFERROR(INDIRECT(CONCATENATE(Fiesta,2+MATCH(B21,Fiestas,0))),\"\"),\"\")","v":""},{"$f":"P15+1","v":"2010-09-20"},{"$f":"IF(ISNUMBER(D21),IFERROR(INDIRECT(CONCATENATE(Fiesta,2+MATCH(D21,Fiestas,0))),\"\"),\"\")","v":""},{"$f":"D21+1","v":"2010-09-21"},{"$f":"IF(ISNUMBER(F21),IFERROR(INDIRECT(CONCATENATE(Fiesta,2+MATCH(F21,Fiestas,0))),\"\"),\"\")","v":""},{"$f":"F21+1","v":"2010-09-22"},{"$f":"IF(ISNUMBER(H21),IFERROR(INDIRECT(CONCATENATE(Fiesta,2+MATCH(H21,Fiestas,0))),\"\"),\"\")","v":""},{"$f":"H21+1","v":"2010-09-23"},{"$f":"IF(ISNUMBER(J21),IFERROR(INDIRECT(CONCATENATE(Fiesta,2+MATCH(J21,Fiestas,0))),\"\"),\"\")","v":""},{"$f":"J21+1","v":"2010-09-24"},{"$f":"IF(ISNUMBER(L21),IFERROR(INDIRECT(CONCATENATE(Fiesta,2+MATCH(L21,Fiestas,0))),\"\"),\"\")","v":""},{"$f":"L21+1","v":"2010-09-25"},{"$f":"IF(ISNUMBER(N21),IFERROR(INDIRECT(CONCATENATE(Fiesta,2+MATCH(N21,Fiestas,0))),\"\"),\"\")","v":""},{"$f":"N21+1","v":"2010-09-26"},{"$f":"IF(ISNUMBER(P21),IFERROR(INDIRECT(CONCATENATE(Fiesta,2+MATCH(P21,Fiestas,0))),\"\"),\"\")","v":""},{"$f":"WEEKNUM(D21,2)","v":39}]
[null,{"$f":"IF(ISNUMBER(B21),IFERROR(INDIRECT(CONCATENATE(Evento,1+MATCH(B21,Eventos,0))),\"\"),\"\")","v":""},null,{"$f":"IF(ISNUMBER(D21),IFERROR(INDIRECT(CONCATENATE(Evento,1+MATCH(D21,Eventos,0))),\"\"),\"\")","v":""},null,{"$f":"IF(ISNUMBER(F21),IFERROR(INDIRECT(CONCATENATE(Evento,1+MATCH(F21,Eventos,0))),\"\"),\"\")","v":"International Day of Peace"},null,{"$f":"IF(ISNUMBER(H21),IFERROR(INDIRECT(CONCATENATE(Evento,1+MATCH(H21,Eventos,0))),\"\"),\"\")","v":"World Car Free Day"},null,{"$f":"IF(ISNUMBER(J21),IFERROR(INDIRECT(CONCATENATE(Evento,1+MATCH(J21,Eventos,0))),\"\"),\"\")","v":""},null,{"$f":"IF(ISNUMBER(L21),IFERROR(INDIRECT(CONCATENATE(Evento,1+MATCH(L21,Eventos,0))),\"\"),\"\")","v":""},null,{"$f":"IF(ISNUMBER(N21),IFERROR(INDIRECT(CONCATENATE(Evento,1+MATCH(N21,Eventos,0))),\"\"),\"\")","v":""},null,{"$f":"IF(ISNUMBER(P21),IFERROR(INDIRECT(CONCATENATE(Evento,1+MATCH(P21,Eventos,0))),\"\"),\"\")","v":"World Heart Day"}]
[null,{"$f":"IF(ISNUMBER(B21),IFERROR(INDIRECT(CONCATENATE(Agenda,1+MATCH(B21,Agendas,0))),\"\"),\"\")","v":""},null,{"$f":"IF(ISNUMBER(D21),IFERROR(INDIRECT(CONCATENATE(Agenda,1+MATCH(D21,Agendas,0))),\"\"),\"\")","v":""},null,{"$f":"IF(ISNUMBER(F21),IFERROR(INDIRECT(CONCATENATE(Agenda,1+MATCH(F21,Agendas,0))),\"\"),\"\")","v":""},null,{"$f":"IF(ISNUMBER(H21),IFERROR(INDIRECT(CONCATENATE(Agenda,1+MATCH(H21,Agendas,0))),\"\"),\"\")","v":""},null,{"$f":"IF(ISNUMBER(J21),IFERROR(INDIRECT(CONCATENATE(Agenda,1+MATCH(J21,Agendas,0))),\"\"),\"\")","v":""},null,{"$f":"IF(ISNUMBER(L21),IFERROR(INDIRECT(CONCATENATE(Agenda,1+MATCH(L21,Agendas,0))),\"\"),\"\")","v":""},null,{"$f":"IF(ISNUMBER(N21),IFERROR(INDIRECT(CONCATENATE(Agenda,1+MATCH(N21,Agendas,0))),\"\"),\"\")","v":""},null,{"$f":"IF(ISNUMBER(P21),IFERROR(INDIRECT(CONCATENATE(Agenda,1+MATCH(P21,Agendas,0))),\"\"),\"\")","v":""}]
[]
[]
[]
[{"$f":"IF(B27=\"\",\"\",WEEKNUM(B27,1))","v":40},{"$f":"P21","v":"2010-09-26"},{"$f":"IF(ISNUMBER(B27),IFERROR(INDIRECT(CONCATENATE(Fiesta,2+MATCH(B27,Fiestas,0))),\"\"),\"\")","v":""},{"$f":"IF(P21<EOMONTH($D$1,0),P21+1,\"\")","v":"2010-09-27"},{"$f":"IF(ISNUMBER(D27),IFERROR(INDIRECT(CONCATENATE(Fiesta,2+MATCH(D27,Fiestas,0))),\"\"),\"\")","v":""},{"$f":"IF(D27<EOMONTH($D$1,0),D27+1,\"\")","v":"2010-09-28"},{"$f":"IF(ISNUMBER(F27),IFERROR(INDIRECT(CONCATENATE(Fiesta,2+MATCH(F27,Fiestas,0))),\"\"),\"\")","v":""},{"$f":"IF(F27<EOMONTH($D$1,0),F27+1,\"\")","v":"2010-09-29"},{"$f":"IF(ISNUMBER(H27),IFERROR(INDIRECT(CONCATENATE(Fiesta,2+MATCH(H27,Fiestas,0))),\"\"),\"\")","v":""},{"$f":"IF(H27<EOMONTH($D$1,0),H27+1,\"\")","v":"2010-09-30"},{"$f":"IF(ISNUMBER(J27),IFERROR(INDIRECT(CONCATENATE(Fiesta,2+MATCH(J27,Fiestas,0))),\"\"),\"\")","v":""},{"$f":"IF(J27<EOMONTH($D$1,0),J27+1,\"\")","v":""},{"$f":"IF(ISNUMBER(L27),IFERROR(INDIRECT(CONCATENATE(Fiesta,2+MATCH(L27,Fiestas,0))),\"\"),\"\")","v":""},{"$f":"IF(L27<EOMONTH($D$1,0),L27+1,\"\")","v":""},{"$f":"IF(ISNUMBER(N27),IFERROR(INDIRECT(CONCATENATE(Fiesta,2+MATCH(N27,Fiestas,0))),\"\"),\"\")","v":""},{"$f":"IF(N27<EOMONTH($D$1,0),N27+1,\"\")","v":""},{"$f":"IF(ISNUMBER(P27),IFERROR(INDIRECT(CONCATENATE(Fiesta,2+MATCH(P27,Fiestas,0))),\"\"),\"\")","v":""},{"$f":"IF(D27=\"\",\"\",WEEKNUM(D27,2))","v":40}]
[null,{"$f":"IF(ISNUMBER(B27),IFERROR(INDIRECT(CONCATENATE(Evento,1+MATCH(B27,Eventos,0))),\"\"),\"\")","v":"World Heart Day"},null,{"$f":"IF(ISNUMBER(D27),IFERROR(INDIRECT(CONCATENATE(Evento,1+MATCH(D27,Eventos,0))),\"\"),\"\")","v":"World Tourism Day"},null,{"$f":"IF(ISNUMBER(F27),IFERROR(INDIRECT(CONCATENATE(Evento,1+MATCH(F27,Eventos,0))),\"\"),\"\")","v":"World Rabies Day"},null,{"$f":"IF(ISNUMBER(H27),IFERROR(INDIRECT(CONCATENATE(Evento,1+MATCH(H27,Eventos,0))),\"\"),\"\")","v":""},null,{"$f":"IF(ISNUMBER(J27),IFERROR(INDIRECT(CONCATENATE(Evento,1+MATCH(J27,Eventos,0))),\"\"),\"\")","v":""},null,{"$f":"IF(ISNUMBER(L27),IFERROR(INDIRECT(CONCATENATE(Evento,1+MATCH(L27,Eventos,0))),\"\"),\"\")","v":""},null,{"$f":"IF(ISNUMBER(N27),IFERROR(INDIRECT(CONCATENATE(Evento,1+MATCH(N27,Eventos,0))),\"\"),\"\")","v":""},null,{"$f":"IF(ISNUMBER(P27),IFERROR(INDIRECT(CONCATENATE(Evento,1+MATCH(P27,Eventos,0))),\"\"),\"\")","v":""}]
[null,{"$f":"IF(ISNUMBER(B27),IFERROR(INDIRECT(CONCATENATE(Agenda,1+MATCH(B27,Agendas,0))),\"\"),\"\")","v":""},null,{"$f":"IF(ISNUMBER(D27),IFERROR(INDIRECT(CONCATENATE(Agenda,1+MATCH(D27,Agendas,0))),\"\"),\"\")","v":""},null,{"$f":"IF(ISNUMBER(F27),IFERROR(INDIRECT(CONCATENATE(Agenda,1+MATCH(F27,Agendas,0))),\"\"),\"\")","v":""},null,{"$f":"IF(ISNUMBER(H27),IFERROR(INDIRECT(CONCATENATE(Agenda,1+MATCH(H27,Agendas,0))),\"\"),\"\")","v":""},null,{"$f":"IF(ISNUMBER(J27),IFERROR(INDIRECT(CONCATENATE(Agenda,1+MATCH(J27,Agendas,0))),\"\"),\"\")","v":""},null,{"$f":"IF(ISNUMBER(L27),IFERROR(INDIRECT(CONCATENATE(Agenda,1+MATCH(L27,Agendas,0))),\"\"),\"\")","v":""},null,{"$f":"IF(ISNUMBER(N27),IFERROR(INDIRECT(CONCATENATE(Agenda,1+MATCH(N27,Agendas,0))),\"\"),\"\")","v":""},null,{"$f":"IF(ISNUMBER(P27),IFERROR(INDIRECT(CONCATENATE(Agenda,1+MATCH(P27,Agendas,0))),\"\"),\"\")","v":""}]
[]
[]
[]
[{"$f":"IF(B33=\"\",\"\",WEEKNUM(B33,1))","v":""},{"$f":"P27","v":""},{"$f":"IF(ISNUMBER(B33),IFERROR(INDIRECT(CONCATENATE(Fiesta,2+MATCH(B33,Fiestas,0))),\"\"),\"\")","v":""},{"$f":"IF(P27<EOMONTH($D$1,0),P27+1,\"\")","v":""},{"$f":"IF(ISNUMBER(D33),IFERROR(INDIRECT(CONCATENATE(Fiesta,2+MATCH(D33,Fiestas,0))),\"\"),\"\")","v":""},{"$f":"IF(D33<EOMONTH($D$1,0),D33+1,\"\")","v":""},{"$f":"IF(ISNUMBER(F33),IFERROR(INDIRECT(CONCATENATE(Fiesta,2+MATCH(F33,Fiestas,0))),\"\"),\"\")","v":""},"Notes:",null,null,null,null,null,null,null,null,null,{"$f":"IF(D33=\"\",\"\",WEEKNUM(D33,2))","v":""}]
[null,{"$f":"IF(ISNUMBER(B33),IFERROR(INDIRECT(CONCATENATE(Evento,1+MATCH(B33,Eventos,0))),\"\"),\"\")","v":""},null,{"$f":"IF(ISNUMBER(D33),IFERROR(INDIRECT(CONCATENATE(Evento,1+MATCH(D33,Eventos,0))),\"\"),\"\")","v":""},null,{"$f":"IF(ISNUMBER(F33),IFERROR(INDIRECT(CONCATENATE(Evento,1+MATCH(F33,Eventos,0))),\"\"),\"\")","v":""}]
[null,{"$f":"IF(ISNUMBER(B33),IFERROR(INDIRECT(CONCATENATE(Agenda,1+MATCH(B33,Agendas,0))),\"\"),\"\")","v":""},null,{"$f":"IF(ISNUMBER(D33),IFERROR(INDIRECT(CONCATENATE(Agenda,1+MATCH(D33,Agendas,0))),\"\"),\"\")","v":""},null,{"$f":"IF(ISNUMBER(F33),IFERROR(INDIRECT(CONCATENATE(Agenda,1+MATCH(F33,Agendas,0))),\"\"),\"\")","v":""}]

{"sheet":"Oct","index":13,"n_rows":35,"n_cols":18,"rows_kept":35,"cut":false,"hidden":false,"merged":[[36,7,36,8],[36,9,36,10],[36,11,36,12],[37,7,37,8],[37,9,37,10],[37,11,37,12],[36,13,36,16],[37,13,37,16],[34,7,34,8],[34,9,34,10],[34,11,34,12],[34,13,34,14],[34,15,34,16],[35,7,35,8],[35,9,35,10],[35,11,35,12],[35,13,35,14],[35,15,35,16],[37,1,37,2],[37,3,37,4],[37,5,37,6],[36,1,36,2],[36,3,36,4],[36,5,36,6],[35,1,35,2],[35,3,35,4],[35,5,35,6],[34,1,34,2],[34,3,34,4],[34,5,34,6],[31,11,31,12],[31,13,31,14],[31,15,31,16],[33,1,33,2],[33,3,33,4],[33,5,33,6],[31,1,31,2],[31,3,31,4],[31,5,31,6],[31,7,31,8],[31,9,31,10],[32,7,32,8],[32,9,32,10],[32,11,32,12],[32,13,32,14],[32,15,32,16],[33,7,33,8],[33,9,33,10],[33,11,33,12],[33,13,33,14],[33,15,33,16],[29,11,29,12],[29,13,29,14],[29,15,29,16],[30,1,30,2],[30,3,30,4],[30,5,30,6],[30,7,30,8],[30,9,30,10],[30,11,30,12],[30,13,30,14],[30,15,30,16],[29,1,29,2],[29,3,29,4],[29,5,29,6],[29,7,29,8],[29,9,29,10],[27,11,27,12],[27,13,27,14],[27,15,27,16],[28,1,28,2],[28,3,28,4],[28,5,28,6],[28,7,28,8],[28,9,28,10],[28,11,28,12],[28,13,28,14],[28,15,28,16],[27,1,27,2],[27,3,27,4],[27,5,27,6],[27,7,27,8],[27,9,27,10],[24,11,24,12],[24,13,24,14],[24,15,24,16],[25,1,25,2],[25,3,25,4],[25,5,25,6],[25,7,25,8],[25,9,25,10],[25,11,25,12],[25,13,25,14],[25,15,25,16],[24,1,24,2],[24,3,24,4],[24,5,24,6],[24,7,24,8],[24,9,24,10],[22,11,22,12],[22,13,22,14],[22,15,22,16],[23,1,23,2],[23,3,23,4],[23,5,23,6],[23,7,23,8],[23,9,23,10],[23,11,23,12],[23,13,23,14],[23,15,23,16],[22,1,22,2],[22,3,22,4],[22,5,22,6],[22,7,22,8],[22,9,22,10],[19,11,19,12],[19,13,19,14],[19,15,19,16],[21,1,21,2],[21,3,21,4],[21,5,21,6],[21,7,21,8],[21,9,21,10],[21,11,21,12],[21,13,21,14],[21,15,21,16],[19,1,19,2],[19,3,19,4],[19,5,19,6],[19,7,19,8],[19,9,19,10],[17,11,17,12],[17,13,17,14],[17,15,17,16],[18,1,18,2],[18,3,18,4],[18,5,18,6],[18,7,18,8],[18,9,18,10],[18,11,18,12],[18,13,18,14],[18,15,18,16],[17,1,17,2],[17,3,17,4],[17,5,17,6],[17,7,17,8],[17,9,17,10],[15,11,15,12],[15,13,15,14],[15,15,15,16],[16,1,16,2],[16,3,16,4],[16,5,16,6],[16,7,16,8],[16,9,16,10],[16,11,16,12],[16,13,16,14],[16,15,16,16],[15,1,15,2],[15,3,15,4],[15,5,15,6],[15,7,15,8],[15,9,15,10],[12,11,12,12],[12,13,12,14],[12,15,12,16],[13,1,13,2],[13,3,13,4],[13,5,13,6],[13,7,13,8],[13,9,13,10],[13,11,13,12],[13,13,13,14],[13,15,13,16],[12,1,12,2],[12,3,12,4],[12,5,12,6],[12,7,12,8],[12,9,12,10],[10,11,10,12],[10,13,10,14],[10,15,10,16],[11,1,11,2],[11,3,11,4],[11,5,11,6],[11,7,11,8],[11,9,11,10],[11,11,11,12],[11,13,11,14],[11,15,11,16],[10,1,10,2],[10,3,10,4],[10,5,10,6],[10,7,10,8],[10,9,10,10],[7,11,7,12],[7,13,7,14],[7,15,7,16],[9,1,9,2],[9,3,9,4],[9,5,9,6],[9,7,9,8],[9,9,9,10],[9,11,9,12],[9,13,9,14],[9,15,9,16],[7,1,7,2],[7,3,7,4],[7,5,7,6],[7,7,7,8],[7,9,7,10],[5,11,5,12],[5,13,5,14],[5,15,5,16],[6,1,6,2],[6,3,6,4],[6,5,6,6],[6,7,6,8],[6,9,6,10],[6,11,6,12],[6,13,6,14],[6,15,6,16],[5,1,5,2],[5,3,5,4],[5,5,5,6],[5,7,5,8],[5,9,5,10],[0,9,0,11],[1,1,1,2],[1,3,1,4],[1,5,1,6],[1,7,1,8],[1,9,1,10],[1,11,1,12],[1,13,1,14],[0,3,0,8],[1,15,1,16],[3,11,3,12],[3,13,3,14],[3,15,3,16],[4,1,4,2],[4,3,4,4],[4,5,4,6],[4,7,4,8],[4,9,4,10],[4,11,4,12],[4,13,4,14],[4,15,4,16],[3,1,3,2],[3,3,3,4],[3,5,3,6],[3,7,3,8],[3,9,3,10]]}
[null,null,null,{"$f":"DATE(Cal!M3,10,1)","v":"2010-10-01"},null,null,null,null,null,{"$f":"Cal!$M$3","v":2010}]
[null,{"$f":"DATE(2010,2,7)","v":"2010-02-07"},null,{"$f":"DATE(2010,2,1)","v":"2010-02-01"},null,{"$f":"DATE(2010,2,2)","v":"2010-02-02"},null,{"$f":"DATE(2010,2,3)","v":"2010-02-03"},null,{"$f":"DATE(2010,2,4)","v":"2010-02-04"},null,{"$f":"DATE(2010,2,5)","v":"2010-02-05"},null,{"$f":"DATE(2010,2,6)","v":"2010-02-06"},null,{"$f":"DATE(2010,2,7)","v":"2010-02-07"}]
[{"$f":"IF(N3=\"\",\"\",WEEKNUM(N3,1))","v":40},null,{"$f":"IF(ISNUMBER(B3),IFERROR(INDIRECT(CONCATENATE(Fiesta,2+MATCH(B3,Fiestas,0))),\"\"),\"\")","v":""},{"$f":"IF(WEEKDAY($D$1)=2,$D$1,\"\")","v":""},{"$f":"IF(ISNUMBER(D3),IFERROR(INDIRECT(CONCATENATE(Fiesta,2+MATCH(D3,Fiestas,0))),\"\"),\"\")","v":""},{"$f":"IF(D3<>\"\",D3+1,IF(WEEKDAY($D$1)=3,$D$1,\"\"))","v":""},{"$f":"IF(ISNUMBER(F3),IFERROR(INDIRECT(CONCATENATE(Fiesta,2+MATCH(F3,Fiestas,0))),\"\"),\"\")","v":""},{"$f":"IF(F3<>\"\",F3+1,IF(WEEKDAY($D$1)=4,$D$1,\"\"))","v":""},{"$f":"IF(ISNUMBER(H3),IFERROR(INDIRECT(CONCATENATE(Fiesta,2+MATCH(H3,Fiestas,0))),\"\"),\"\")","v":""},{"$f":"IF(H3<>\"\",H3+1,IF(WEEKDAY($D$1)=5,$D$1,\"\"))","v":""},{"$f":"IF(ISNUMBER(J3),IFERROR(INDIRECT(CONCATENATE(Fiesta,2+MATCH(J3,Fiestas,0))),\"\"),\"\")","v":""},{"$f":"IF(J3<>\"\",J3+1,IF(WEEKDAY($D$1)=6,$D$1,\"\"))","v":"2010-10-01"},{"$f":"IF(ISNUMBER(L3),IFERROR(INDIRECT(CONCATENATE(Fiesta,2+MATCH(L3,Fiestas,0))),\"\"),\"\")","v":""},{"$f":"IF(L3<>\"\",L3+1,IF(WEEKDAY($D$1)=7,$D$1,\"\"))","v":"2010-10-02"},{"$f":"IF(ISNUMBER(N3),IFERROR(INDIRECT(CONCATENATE(Fiesta,2+MATCH(N3,Fiestas,0))),\"\"),\"\")","v":""},{"$f":"IF(N3<>\"\",N3+1,IF(WEEKDAY($D$1)=1,$D$1,\"\"))","v":"2010-10-03"},{"$f":"IF(ISNUMBER(P3),IFERROR(INDIRECT(CONCATENATE(Fiesta,2+MATCH(P3,Fiestas,0))),\"\"),\"\")","v":""},{"$f":"IF(P3=\"\",\"\",WEEKNUM(P3,2))","v":40}]
[null,{"$f":"IF(ISNUMBER(B3),IFERROR(INDIRECT(CONCATENATE(Evento,1+MATCH(B3,Eventos,0))),\"\"),\"\")","v":""},null,{"$f":"IF(ISNUMBER(D3),IFERROR(INDIRECT(CONCATENATE(Evento,1+MATCH(D3,Eventos,0))),\"\"),\"\")","v":""},null,{"$f":"IF(ISNUMBER(F3),IFERROR(INDIRECT(CONCATENATE(Evento,1+MATCH(F3,Eventos,0))),\"\"),\"\")","v":""},null,{"$f":"IF(ISNUMBER(H3),IFERROR(INDIRECT(CONCATENATE(Evento,1+MATCH(H3,Eventos,0))),\"\"),\"\")","v":""},null,{"$f":"IF(ISNUMBER(J3),IFERROR(INDIRECT(CONCATENATE(Evento,1+MATCH(J3,Eventos,0))),\"\"),\"\")","v":""},null,{"$f":"IF(ISNUMBER(L3),IFERROR(INDIRECT(CONCATENATE(Evento,1+MATCH(L3,Eventos,0))),\"\"),\"\")","v":"World Vegetarian Day"},null,{"$f":"IF(ISNUMBER(N3),IFERROR(INDIRECT(CONCATENATE(Evento,1+MATCH(N3,Eventos,0))),\"\"),\"\")","v":"International Day of Non-Violence"},null,{"$f":"IF(ISNUMBER(P3),IFERROR(INDIRECT(CONCATENATE(Evento,1+MATCH(P3,Eventos,0))),\"\"),\"\")","v":""}]
[null,{"$f":"IF(ISNUMBER(B3),IFERROR(INDIRECT(CONCATENATE(Agenda,1+MATCH(B3,Agendas,0))),\"\"),\"\")","v":""},null,{"$f":"IF(ISNUMBER(D3),IFERROR(INDIRECT(CONCATENATE(Agenda,1+MATCH(D3,Agendas,0))),\"\"),\"\")","v":""},null,{"$f":"IF(ISNUMBER(F3),IFERROR(INDIRECT(CONCATENATE(Agenda,1+MATCH(F3,Agendas,0))),\"\"),\"\")","v":""},null,{"$f":"IF(ISNUMBER(H3),IFERROR(INDIRECT(CONCATENATE(Agenda,1+MATCH(H3,Agendas,0))),\"\"),\"\")","v":""},null,{"$f":"IF(ISNUMBER(J3),IFERROR(INDIRECT(CONCATENATE(Agenda,1+MATCH(J3,Agendas,0))),\"\"),\"\")","v":""},null,{"$f":"IF(ISNUMBER(L3),IFERROR(INDIRECT(CONCATENATE(Agenda,1+MATCH(L3,Agendas,0))),\"\"),\"\")","v":""},null,{"$f":"IF(ISNUMBER(N3),IFERROR(INDIRECT(CONCATENATE(Agenda,1+MATCH(N3,Agendas,0))),\"\"),\"\")","v":""},null,{"$f":"IF(ISNUMBER(P3),IFERROR(INDIRECT(CONCATENATE(Agenda,1+MATCH(P3,Agendas,0))),\"\"),\"\")","v":""}]
[]
[]
[]
[{"$f":"WEEKNUM(B9,1)","v":41},{"$f":"P3","v":"2010-10-03"},{"$f":"IF(ISNUMBER(B9),IFERROR(INDIRECT(CONCATENATE(Fiesta,2+MATCH(B9,Fiestas,0))),\"\"),\"\")","v":""},{"$f":"P3+1","v":"2010-10-04"},{"$f":"IF(ISNUMBER(D9),IFERROR(INDIRECT(CONCATENATE(Fiesta,2+MATCH(D9,Fiestas,0))),\"\"),\"\")","v":""},{"$f":"D9+1","v":"2010-10-05"},{"$f":"IF(ISNUMBER(F9),IFERROR(INDIRECT(CONCATENATE(Fiesta,2+MATCH(F9,Fiestas,0))),\"\"),\"\")","v":""},{"$f":"F9+1","v":"2010-10-06"},{"$f":"IF(ISNUMBER(H9),IFERROR(INDIRECT(CONCATENATE(Fiesta,2+MATCH(H9,Fiestas,0))),\"\"),\"\")","v":""},{"$f":"H9+1","v":"2010-10-07"},{"$f":"IF(ISNUMBER(J9),IFERROR(INDIRECT(CONCATENATE(Fiesta,2+MATCH(J9,Fiestas,0))),\"\"),\"\")","v":""},{"$f":"J9+1","v":"2010-10-08"},{"$f":"IF(ISNUMBER(L9),IFERROR(INDIRECT(CONCATENATE(Fiesta,2+MATCH(L9,Fiestas,0))),\"\"),\"\")","v":""},{"$f":"L9+1","v":"2010-10-09"},{"$f":"IF(ISNUMBER(N9),IFERROR(INDIRECT(CONCATENATE(Fiesta,2+MATCH(N9,Fiestas,0))),\"\"),\"\")","v":""},{"$f":"N9+1","v":"2010-10-10"},{"$f":"IF(ISNUMBER(P9),IFERROR(INDIRECT(CONCATENATE(Fiesta,2+MATCH(P9,Fiestas,0))),\"\"),\"\")","v":""},{"$f":"WEEKNUM(D9,2)","v":41}]
[null,{"$f":"IF(ISNUMBER(B9),IFERROR(INDIRECT(CONCATENATE(Evento,1+MATCH(B9,Eventos,0))),\"\"),\"\")","v":""},null,{"$f":"IF(ISNUMBER(D9),IFERROR(INDIRECT(CONCATENATE(Evento,1+MATCH(D9,Eventos,0))),\"\"),\"\")","v":""},null,{"$f":"IF(ISNUMBER(F9),IFERROR(INDIRECT(CONCATENATE(Evento,1+MATCH(F9,Eventos,0))),\"\"),\"\")","v":"World Teachers' Day"},null,{"$f":"IF(ISNUMBER(H9),IFERROR(INDIRECT(CONCATENATE(Evento,1+MATCH(H9,Eventos,0))),\"\"),\"\")","v":""},null,{"$f":"IF(ISNUMBER(J9),IFERROR(INDIRECT(CONCATENATE(Evento,1+MATCH(J9,Eventos,0))),\"\"),\"\")","v":""},null,{"$f":"IF(ISNUMBER(L9),IFERROR(INDIRECT(CONCATENATE(Evento,1+MATCH(L9,Eventos,0))),\"\"),\"\")","v":"World Humanitarian Action Day"},null,{"$f":"IF(ISNUMBER(N9),IFERROR(INDIRECT(CONCATENATE(Evento,1+MATCH(N9,Eventos,0))),\"\"),\"\")","v":"World Post Day"},null,{"$f":"IF(ISNUMBER(P9),IFERROR(INDIRECT(CONCATENATE(Evento,1+MATCH(P9,Eventos,0))),\"\"),\"\")","v":"World Mental Health Day"}]
[null,{"$f":"IF(ISNUMBER(B9),IFERROR(INDIRECT(CONCATENATE(Agenda,1+MATCH(B9,Agendas,0))),\"\"),\"\")","v":""},null,{"$f":"IF(ISNUMBER(D9),IFERROR(INDIRECT(CONCATENATE(Agenda,1+MATCH(D9,Agendas,0))),\"\"),\"\")","v":""},null,{"$f":"IF(ISNUMBER(F9),IFERROR(INDIRECT(CONCATENATE(Agenda,1+MATCH(F9,Agendas,0))),\"\"),\"\")","v":""},null,{"$f":"IF(ISNUMBER(H9),IFERROR(INDIRECT(CONCATENATE(Agenda,1+MATCH(H9,Agendas,0))),\"\"),\"\")","v":""},null,{"$f":"IF(ISNUMBER(J9),IFERROR(INDIRECT(CONCATENATE(Agenda,1+MATCH(J9,Agendas,0))),\"\"),\"\")","v":""},null,{"$f":"IF(ISNUMBER(L9),IFERROR(INDIRECT(CONCATENATE(Agenda,1+MATCH(L9,Agendas,0))),\"\"),\"\")","v":""},null,{"$f":"IF(ISNUMBER(N9),IFERROR(INDIRECT(CONCATENATE(Agenda,1+MATCH(N9,Agendas,0))),\"\"),\"\")","v":""},null,{"$f":"IF(ISNUMBER(P9),IFERROR(INDIRECT(CONCATENATE(Agenda,1+MATCH(P9,Agendas,0))),\"\"),\"\")","v":""}]
[]
[]
[]
[{"$f":"WEEKNUM(B15,1)","v":42},{"$f":"P9","v":"2010-10-10"},{"$f":"IF(ISNUMBER(B15),IFERROR(INDIRECT(CONCATENATE(Fiesta,2+MATCH(B15,Fiestas,0))),\"\"),\"\")","v":""},{"$f":"P9+1","v":"2010-10-11"},{"$f":"IF(ISNUMBER(D15),IFERROR(INDIRECT(CONCATENATE(Fiesta,2+MATCH(D15,Fiestas,0))),\"\"),\"\")","v":"Columbus Day"},{"$f":"D15+1","v":"2010-10-12"},{"$f":"IF(ISNUMBER(F15),IFERROR(INDIRECT(CONCATENATE(Fiesta,2+MATCH(F15,Fiestas,0))),\"\"),\"\")","v":""},{"$f":"F15+1","v":"2010-10-13"},{"$f":"IF(ISNUMBER(H15),IFERROR(INDIRECT(CONCATENATE(Fiesta,2+MATCH(H15,Fiestas,0))),\"\"),\"\")","v":""},{"$f":"H15+1","v":"2010-10-14"},{"$f":"IF(ISNUMBER(J15),IFERROR(INDIRECT(CONCATENATE(Fiesta,2+MATCH(J15,Fiestas,0))),\"\"),\"\")","v":""},{"$f":"J15+1","v":"2010-10-15"},{"$f":"IF(ISNUMBER(L15),IFERROR(INDIRECT(CONCATENATE(Fiesta,2+MATCH(L15,Fiestas,0))),\"\"),\"\")","v":""},{"$f":"L15+1","v":"2010-10-16"},{"$f":"IF(ISNUMBER(N15),IFERROR(INDIRECT(CONCATENATE(Fiesta,2+MATCH(N15,Fiestas,0))),\"\"),\"\")","v":""},{"$f":"N15+1","v":"2010-10-17"},{"$f":"IF(ISNUMBER(P15),IFERROR(INDIRECT(CONCATENATE(Fiesta,2+MATCH(P15,Fiestas,0))),\"\"),\"\")","v":""},{"$f":"WEEKNUM(D15,2)","v":42}]
[null,{"$f":"IF(ISNUMBER(B15),IFERROR(INDIRECT(CONCATENATE(Evento,1+MATCH(B15,Eventos,0))),\"\"),\"\")","v":"World Mental Health Day"},null,{"$f":"IF(ISNUMBER(D15),IFERROR(INDIRECT(CONCATENATE(Evento,1+MATCH(D15,Eventos,0))),\"\"),\"\")","v":""},null,{"$f":"IF(ISNUMBER(F15),IFERROR(INDIRECT(CONCATENATE(Evento,1+MATCH(F15,Eventos,0))),\"\"),\"\")","v":""},null,{"$f":"IF(ISNUMBER(H15),IFERROR(INDIRECT(CONCATENATE(Evento,1+MATCH(H15,Eventos,0))),\"\"),\"\")","v":""},null,{"$f":"IF(ISNUMBER(J15),IFERROR(INDIRECT(CONCATENATE(Evento,1+MATCH(J15,Eventos,0))),\"\"),\"\")","v":"World Standards Day"},null,{"$f":"IF(ISNUMBER(L15),IFERROR(INDIRECT(CONCATENATE(Evento,1+MATCH(L15,Eventos,0))),\"\"),\"\")","v":"Global Handwashing Day"},null,{"$f":"IF(ISNUMBER(N15),IFERROR(INDIRECT(CONCATENATE(Evento,1+MATCH(N15,Eventos,0))),\"\"),\"\")","v":"World Food Day"},null,{"$f":"IF(ISNUMBER(P15),IFERROR(INDIRECT(CONCATENATE(Evento,1+MATCH(P15,Eventos,0))),\"\"),\"\")","v":"International Day for the Eradication of Poverty"}]
[null,{"$f":"IF(ISNUMBER(B15),IFERROR(INDIRECT(CONCATENATE(Agenda,1+MATCH(B15,Agendas,0))),\"\"),\"\")","v":""},null,{"$f":"IF(ISNUMBER(D15),IFERROR(INDIRECT(CONCATENATE(Agenda,1+MATCH(D15,Agendas,0))),\"\"),\"\")","v":""},null,{"$f":"IF(ISNUMBER(F15),IFERROR(INDIRECT(CONCATENATE(Agenda,1+MATCH(F15,Agendas,0))),\"\"),\"\")","v":""},null,{"$f":"IF(ISNUMBER(H15),IFERROR(INDIRECT(CONCATENATE(Agenda,1+MATCH(H15,Agendas,0))),\"\"),\"\")","v":""},null,{"$f":"IF(ISNUMBER(J15),IFERROR(INDIRECT(CONCATENATE(Agenda,1+MATCH(J15,Agendas,0))),\"\"),\"\")","v":""},null,{"$f":"IF(ISNUMBER(L15),IFERROR(INDIRECT(CONCATENATE(Agenda,1+MATCH(L15,Agendas,0))),\"\"),\"\")","v":""},null,{"$f":"IF(ISNUMBER(N15),IFERROR(INDIRECT(CONCATENATE(Agenda,1+MATCH(N15,Agendas,0))),\"\"),\"\")","v":""},null,{"$f":"IF(ISNUMBER(P15),IFERROR(INDIRECT(CONCATENATE(Agenda,1+MATCH(P15,Agendas,0))),\"\"),\"\")","v":""}]
[]
[]
[]
[{"$f":"WEEKNUM(B21,1)","v":43},{"$f":"P15","v":"2010-10-17"},{"$f":"IF(ISNUMBER(B21),IFERROR(INDIRECT(CONCATENATE(Fiesta,2+MATCH(B21,Fiestas,0))),\"\"),\"\")","v":""},{"$f":"P15+1","v":"2010-10-18"},{"$f":"IF(ISNUMBER(D21),IFERROR(INDIRECT(CONCATENATE(Fiesta,2+MATCH(D21,Fiestas,0))),\"\"),\"\")","v":""},{"$f":"D21+1","v":"2010-10-19"},{"$f":"IF(ISNUMBER(F21),IFERROR(INDIRECT(CONCATENATE(Fiesta,2+MATCH(F21,Fiestas,0))),\"\"),\"\")","v":""},{"$f":"F21+1","v":"2010-10-20"},{"$f":"IF(ISNUMBER(H21),IFERROR(INDIRECT(CONCATENATE(Fiesta,2+MATCH(H21,Fiestas,0))),\"\"),\"\")","v":""},{"$f":"H21+1","v":"2010-10-21"},{"$f":"IF(ISNUMBER(J21),IFERROR(INDIRECT(CONCATENATE(Fiesta,2+MATCH(J21,Fiestas,0))),\"\"),\"\")","v":""},{"$f":"J21+1","v":"2010-10-22"},{"$f":"IF(ISNUMBER(L21),IFERROR(INDIRECT(CONCATENATE(Fiesta,2+MATCH(L21,Fiestas,0))),\"\"),\"\")","v":""},{"$f":"L21+1","v":"2010-10-23"},{"$f":"IF(ISNUMBER(N21),IFERROR(INDIRECT(CONCATENATE(Fiesta,2+MATCH(N21,Fiestas,0))),\"\"),\"\")","v":""},{"$f":"N21+1","v":"2010-10-24"},{"$f":"IF(ISNUMBER(P21),IFERROR(INDIRECT(CONCATENATE(Fiesta,2+MATCH(P21,Fiestas,0))),\"\"),\"\")","v":""},{"$f":"WEEKNUM(D21,2)","v":43}]
[null,{"$f":"IF(ISNUMBER(B21),IFERROR(INDIRECT(CONCATENATE(Evento,1+MATCH(B21,Eventos,0))),\"\"),\"\")","v":"International Day for the Eradication of Poverty"},null,{"$f":"IF(ISNUMBER(D21),IFERROR(INDIRECT(CONCATENATE(Evento,1+MATCH(D21,Eventos,0))),\"\"),\"\")","v":"World Menopause Day"},null,{"$f":"IF(ISNUMBER(F21),IFERROR(INDIRECT(CONCATENATE(Evento,1+MATCH(F21,Eventos,0))),\"\"),\"\")","v":""},null,{"$f":"IF(ISNUMBER(H21),IFERROR(INDIRECT(CONCATENATE(Evento,1+MATCH(H21,Eventos,0))),\"\"),\"\")","v":"World Osteoporosis Day"},null,{"$f":"IF(ISNUMBER(J21),IFERROR(INDIRECT(CONCATENATE(Evento,1+MATCH(J21,Eventos,0))),\"\"),\"\")","v":""},null,{"$f":"IF(ISNUMBER(L21),IFERROR(INDIRECT(CONCATENATE(Evento,1+MATCH(L21,Eventos,0))),\"\"),\"\")","v":""},null,{"$f":"IF(ISNUMBER(N21),IFERROR(INDIRECT(CONCATENATE(Evento,1+MATCH(N21,Eventos,0))),\"\"),\"\")","v":""},null,{"$f":"IF(ISNUMBER(P21),IFERROR(INDIRECT(CONCATENATE(Evento,1+MATCH(P21,Eventos,0))),\"\"),\"\")","v":"United Nations Day"}]
[null,{"$f":"IF(ISNUMBER(B21),IFERROR(INDIRECT(CONCATENATE(Agenda,1+MATCH(B21,Agendas,0))),\"\"),\"\")","v":""},null,{"$f":"IF(ISNUMBER(D21),IFERROR(INDIRECT(CONCATENATE(Agenda,1+MATCH(D21,Agendas,0))),\"\"),\"\")","v":""},null,{"$f":"IF(ISNUMBER(F21),IFERROR(INDIRECT(CONCATENATE(Agenda,1+MATCH(F21,Agendas,0))),\"\"),\"\")","v":""},null,{"$f":"IF(ISNUMBER(H21),IFERROR(INDIRECT(CONCATENATE(Agenda,1+MATCH(H21,Agendas,0))),\"\"),\"\")","v":""},null,{"$f":"IF(ISNUMBER(J21),IFERROR(INDIRECT(CONCATENATE(Agenda,1+MATCH(J21,Agendas,0))),\"\"),\"\")","v":""},null,{"$f":"IF(ISNUMBER(L21),IFERROR(INDIRECT(CONCATENATE(Agenda,1+MATCH(L21,Agendas,0))),\"\"),\"\")","v":""},null,{"$f":"IF(ISNUMBER(N21),IFERROR(INDIRECT(CONCATENATE(Agenda,1+MATCH(N21,Agendas,0))),\"\"),\"\")","v":""},null,{"$f":"IF(ISNUMBER(P21),IFERROR(INDIRECT(CONCATENATE(Agenda,1+MATCH(P21,Agendas,0))),\"\"),\"\")","v":""}]
[]
[]
[]
[{"$f":"IF(B27=\"\",\"\",WEEKNUM(B27,1))","v":44},{"$f":"P21","v":"2010-10-24"},{"$f":"IF(ISNUMBER(B27),IFERROR(INDIRECT(CONCATENATE(Fiesta,2+MATCH(B27,Fiestas,0))),\"\"),\"\")","v":""},{"$f":"IF(P21<EOMONTH($D$1,0),P21+1,\"\")","v":"2010-10-25"},{"$f":"IF(ISNUMBER(D27),IFERROR(INDIRECT(CONCATENATE(Fiesta,2+MATCH(D27,Fiestas,0))),\"\"),\"\")","v":""},{"$f":"IF(D27<EOMONTH($D$1,0),D27+1,\"\")","v":"2010-10-26"},{"$f":"IF(ISNUMBER(F27),IFERROR(INDIRECT(CONCATENATE(Fiesta,2+MATCH(F27,Fiestas,0))),\"\"),\"\")","v":""},{"$f":"IF(F27<EOMONTH($D$1,0),F27+1,\"\")","v":"2010-10-27"},{"$f":"IF(ISNUMBER(H27),IFERROR(INDIRECT(CONCATENATE(Fiesta,2+MATCH(H27,Fiestas,0))),\"\"),\"\")","v":""},{"$f":"IF(H27<EOMONTH($D$1,0),H27+1,\"\")","v":"2010-10-28"},{"$f":"IF(ISNUMBER(J27),IFERROR(INDIRECT(CONCATENATE(Fiesta,2+MATCH(J27,Fiestas,0))),\"\"),\"\")","v":""},{"$f":"IF(J27<EOMONTH($D$1,0),J27+1,\"\")","v":"2010-10-29"},{"$f":"IF(ISNUMBER(L27),IFERROR(INDIRECT(CONCATENATE(Fiesta,2+MATCH(L27,Fiestas,0))),\"\"),\"\")","v":""},{"$f":"IF(L27<EOMONTH($D$1,0),L27+1,\"\")","v":"2010-10-30"},{"$f":"IF(ISNUMBER(N27),IFERROR(INDIRECT(CONCATENATE(Fiesta,2+MATCH(N27,Fiestas,0))),\"\"),\"\")","v":""},{"$f":"IF(N27<EOMONTH($D$1,0),N27+1,\"\")","v":"2010-10-31"},{"$f":"IF(ISNUMBER(P27),IFERROR(INDIRECT(CONCATENATE(Fiesta,2+MATCH(P27,Fiestas,0))),\"\"),\"\")","v":""},{"$f":"IF(D27=\"\",\"\",WEEKNUM(D27,2))","v":44}]
[null,{"$f":"IF(ISNUMBER(B27),IFERROR(INDIRECT(CONCATENATE(Evento,1+MATCH(B27,Eventos,0))),\"\"),\"\")","v":"United Nations Day"},null,{"$f":"IF(ISNUMBER(D27),IFERROR(INDIRECT(CONCATENATE(Evento,1+MATCH(D27,Eventos,0))),\"\"),\"\")","v":""},null,{"$f":"IF(ISNUMBER(F27),IFERROR(INDIRECT(CONCATENATE(Evento,1+MATCH(F27,Eventos,0))),\"\"),\"\")","v":""},null,{"$f":"IF(ISNUMBER(H27),IFERROR(INDIRECT(CONCATENATE(Evento,1+MATCH(H27,Eventos,0))),\"\"),\"\")","v":""},null,{"$f":"IF(ISNUMBER(J27),IFERROR(INDIRECT(CONCATENATE(Evento,1+MATCH(J27,Eventos,0))),\"\"),\"\")","v":""},null,{"$f":"IF(ISNUMBER(L27),IFERROR(INDIRECT(CONCATENATE(Evento,1+MATCH(L27,Eventos,0))),\"\"),\"\")","v":"World Stroke Day"},null,{"$f":"IF(ISNUMBER(N27),IFERROR(INDIRECT(CONCATENATE(Evento,1+MATCH(N27,Eventos,0))),\"\"),\"\")","v":""},null,{"$f":"IF(ISNUMBER(P27),IFERROR(INDIRECT(CONCATENATE(Evento,1+MATCH(P27,Eventos,0))),\"\"),\"\")","v":"World Savings Day"}]
[null,{"$f":"IF(ISNUMBER(B27),IFERROR(INDIRECT(CONCATENATE(Agenda,1+MATCH(B27,Agendas,0))),\"\"),\"\")","v":""},null,{"$f":"IF(ISNUMBER(D27),IFERROR(INDIRECT(CONCATENATE(Agenda,1+MATCH(D27,Agendas,0))),\"\"),\"\")","v":""},null,{"$f":"IF(ISNUMBER(F27),IFERROR(INDIRECT(CONCATENATE(Agenda,1+MATCH(F27,Agendas,0))),\"\"),\"\")","v":""},null,{"$f":"IF(ISNUMBER(H27),IFERROR(INDIRECT(CONCATENATE(Agenda,1+MATCH(H27,Agendas,0))),\"\"),\"\")","v":""},null,{"$f":"IF(ISNUMBER(J27),IFERROR(INDIRECT(CONCATENATE(Agenda,1+MATCH(J27,Agendas,0))),\"\"),\"\")","v":""},null,{"$f":"IF(ISNUMBER(L27),IFERROR(INDIRECT(CONCATENATE(Agenda,1+MATCH(L27,Agendas,0))),\"\"),\"\")","v":""},null,{"$f":"IF(ISNUMBER(N27),IFERROR(INDIRECT(CONCATENATE(Agenda,1+MATCH(N27,Agendas,0))),\"\"),\"\")","v":""},null,{"$f":"IF(ISNUMBER(P27),IFERROR(INDIRECT(CONCATENATE(Agenda,1+MATCH(P27,Agendas,0))),\"\"),\"\")","v":""}]
[]
[]
[]
[{"$f":"IF(B33=\"\",\"\",WEEKNUM(B33,1))","v":45},{"$f":"P27","v":"2010-10-31"},{"$f":"IF(ISNUMBER(B33),IFERROR(INDIRECT(CONCATENATE(Fiesta,2+MATCH(B33,Fiestas,0))),\"\"),\"\")","v":""},{"$f":"IF(P27<EOMONTH($D$1,0),P27+1,\"\")","v":""},{"$f":"IF(ISNUMBER(D33),IFERROR(INDIRECT(CONCATENATE(Fiesta,2+MATCH(D33,Fiestas,0))),\"\"),\"\")","v":""},{"$f":"IF(D33<EOMONTH($D$1,0),D33+1,\"\")","v":""},{"$f":"IF(ISNUMBER(F33),IFERROR(INDIRECT(CONCATENATE(Fiesta,2+MATCH(F33,Fiestas,0))),\"\"),\"\")","v":""},"Notes:",null,null,null,null,null,null,null,null,null,{"$f":"IF(D33=\"\",\"\",WEEKNUM(D33,2))","v":""}]
[null,{"$f":"IF(ISNUMBER(B33),IFERROR(INDIRECT(CONCATENATE(Evento,1+MATCH(B33,Eventos,0))),\"\"),\"\")","v":"World Savings Day"},null,{"$f":"IF(ISNUMBER(D33),IFERROR(INDIRECT(CONCATENATE(Evento,1+MATCH(D33,Eventos,0))),\"\"),\"\")","v":""},null,{"$f":"IF(ISNUMBER(F33),IFERROR(INDIRECT(CONCATENATE(Evento,1+MATCH(F33,Eventos,0))),\"\"),\"\")","v":""}]
[null,{"$f":"IF(ISNUMBER(B33),IFERROR(INDIRECT(CONCATENATE(Agenda,1+MATCH(B33,Agendas,0))),\"\"),\"\")","v":""},null,{"$f":"IF(ISNUMBER(D33),IFERROR(INDIRECT(CONCATENATE(Agenda,1+MATCH(D33,Agendas,0))),\"\"),\"\")","v":""},null,{"$f":"IF(ISNUMBER(F33),IFERROR(INDIRECT(CONCATENATE(Agenda,1+MATCH(F33,Agendas,0))),\"\"),\"\")","v":""}]

{"sheet":"Nov","index":14,"n_rows":35,"n_cols":18,"rows_kept":35,"cut":false,"hidden":false,"merged":[[36,7,36,8],[36,9,36,10],[36,11,36,12],[37,7,37,8],[37,9,37,10],[37,11,37,12],[36,13,36,16],[37,13,37,16],[34,7,34,8],[34,9,34,10],[34,11,34,12],[34,13,34,14],[34,15,34,16],[35,7,35,8],[35,9,35,10],[35,11,35,12],[35,13,35,14],[35,15,35,16],[37,1,37,2],[37,3,37,4],[37,5,37,6],[36,1,36,2],[36,3,36,4],[36,5,36,6],[35,1,35,2],[35,3,35,4],[35,5,35,6],[34,1,34,2],[34,3,34,4],[34,5,34,6],[31,11,31,12],[31,13,31,14],[31,15,31,16],[33,1,33,2],[33,3,33,4],[33,5,33,6],[31,1,31,2],[31,3,31,4],[31,5,31,6],[31,7,31,8],[31,9,31,10],[32,7,32,8],[32,9,32,10],[32,11,32,12],[32,13,32,14],[32,15,32,16],[33,7,33,8],[33,9,33,10],[33,11,33,12],[33,13,33,14],[33,15,33,16],[29,11,29,12],[29,13,29,14],[29,15,29,16],[30,1,30,2],[30,3,30,4],[30,5,30,6],[30,7,30,8],[30,9,30,10],[30,11,30,12],[30,13,30,14],[30,15,30,16],[29,1,29,2],[29,3,29,4],[29,5,29,6],[29,7,29,8],[29,9,29,10],[27,11,27,12],[27,13,27,14],[27,15,27,16],[28,1,28,2],[28,3,28,4],[28,5,28,6],[28,7,28,8],[28,9,28,10],[28,11,28,12],[28,13,28,14],[28,15,28,16],[27,1,27,2],[27,3,27,4],[27,5,27,6],[27,7,27,8],[27,9,27,10],[24,11,24,12],[24,13,24,14],[24,15,24,16],[25,1,25,2],[25,3,25,4],[25,5,25,6],[25,7,25,8],[25,9,25,10],[25,11,25,12],[25,13,25,14],[25,15,25,16],[24,1,24,2],[24,3,24,4],[24,5,24,6],[24,7,24,8],[24,9,24,10],[22,11,22,12],[22,13,22,14],[22,15,22,16],[23,1,23,2],[23,3,23,4],[23,5,23,6],[23,7,23,8],[23,9,23,10],[23,11,23,12],[23,13,23,14],[23,15,23,16],[22,1,22,2],[22,3,22,4],[22,5,22,6],[22,7,22,8],[22,9,22,10],[19,11,19,12],[19,13,19,14],[19,15,19,16],[21,1,21,2],[21,3,21,4],[21,5,21,6],[21,7,21,8],[21,9,21,10],[21,11,21,12],[21,13,21,14],[21,15,21,16],[19,1,19,2],[19,3,19,4],[19,5,19,6],[19,7,19,8],[19,9,19,10],[17,11,17,12],[17,13,17,14],[17,15,17,16],[18,1,18,2],[18,3,18,4],[18,5,18,6],[18,7,18,8],[18,9,18,10],[18,11,18,12],[18,13,18,14],[18,15,18,16],[17,1,17,2],[17,3,17,4],[17,5,17,6],[17,7,17,8],[17,9,17,10],[15,11,15,12],[15,13,15,14],[15,15,15,16],[16,1,16,2],[16,3,16,4],[16,5,16,6],[16,7,16,8],[16,9,16,10],[16,11,16,12],[16,13,16,14],[16,15,16,16],[15,1,15,2],[15,3,15,4],[15,5,15,6],[15,7,15,8],[15,9,15,10],[12,11,12,12],[12,13,12,14],[12,15,12,16],[13,1,13,2],[13,3,13,4],[13,5,13,6],[13,7,13,8],[13,9,13,10],[13,11,13,12],[13,13,13,14],[13,15,13,16],[12,1,12,2],[12,3,12,4],[12,5,12,6],[12,7,12,8],[12,9,12,10],[10,11,10,12],[10,13,10,14],[10,15,10,16],[11,1,11,2],[11,3,11,4],[11,5,11,6],[11,7,11,8],[11,9,11,10],[11,11,11,12],[11,13,11,14],[11,15,11,16],[10,1,10,2],[10,3,10,4],[10,5,10,6],[10,7,10,8],[10,9,10,10],[7,11,7,12],[7,13,7,14],[7,15,7,16],[9,1,9,2],[9,3,9,4],[9,5,9,6],[9,7,9,8],[9,9,9,10],[9,11,9,12],[9,13,9,14],[9,15,9,16],[7,1,7,2],[7,3,7,4],[7,5,7,6],[7,7,7,8],[7,9,7,10],[5,11,5,12],[5,13,5,14],[5,15,5,16],[6,1,6,2],[6,3,6,4],[6,5,6,6],[6,7,6,8],[6,9,6,10],[6,11,6,12],[6,13,6,14],[6,15,6,16],[5,1,5,2],[5,3,5,4],[5,5,5,6],[5,7,5,8],[5,9,5,10],[0,9,0,11],[1,1,1,2],[1,3,1,4],[1,5,1,6],[1,7,1,8],[1,9,1,10],[1,11,1,12],[1,13,1,14],[0,3,0,8],[1,15,1,16],[3,11,3,12],[3,13,3,14],[3,15,3,16],[4,1,4,2],[4,3,4,4],[4,5,4,6],[4,7,4,8],[4,9,4,10],[4,11,4,12],[4,13,4,14],[4,15,4,16],[3,1,3,2],[3,3,3,4],[3,5,3,6],[3,7,3,8],[3,9,3,10]]}
[null,null,null,{"$f":"DATE(Cal!M3,11,1)","v":"2010-11-01"},null,null,null,null,null,{"$f":"Cal!$M$3","v":2010}]
[null,{"$f":"DATE(2010,2,7)","v":"2010-02-07"},null,{"$f":"DATE(2010,2,1)","v":"2010-02-01"},null,{"$f":"DATE(2010,2,2)","v":"2010-02-02"},null,{"$f":"DATE(2010,2,3)","v":"2010-02-03"},null,{"$f":"DATE(2010,2,4)","v":"2010-02-04"},null,{"$f":"DATE(2010,2,5)","v":"2010-02-05"},null,{"$f":"DATE(2010,2,6)","v":"2010-02-06"},null,{"$f":"DATE(2010,2,7)","v":"2010-02-07"}]
[{"$f":"IF(N3=\"\",\"\",WEEKNUM(N3,1))","v":45},null,{"$f":"IF(ISNUMBER(B3),IFERROR(INDIRECT(CONCATENATE(Fiesta,2+MATCH(B3,Fiestas,0))),\"\"),\"\")","v":""},{"$f":"IF(WEEKDAY($D$1)=2,$D$1,\"\")","v":"2010-11-01"},{"$f":"IF(ISNUMBER(D3),IFERROR(INDIRECT(CONCATENATE(Fiesta,2+MATCH(D3,Fiestas,0))),\"\"),\"\")","v":""},{"$f":"IF(D3<>\"\",D3+1,IF(WEEKDAY($D$1)=3,$D$1,\"\"))","v":"2010-11-02"},{"$f":"IF(ISNUMBER(F3),IFERROR(INDIRECT(CONCATENATE(Fiesta,2+MATCH(F3,Fiestas,0))),\"\"),\"\")","v":""},{"$f":"IF(F3<>\"\",F3+1,IF(WEEKDAY($D$1)=4,$D$1,\"\"))","v":"2010-11-03"},{"$f":"IF(ISNUMBER(H3),IFERROR(INDIRECT(CONCATENATE(Fiesta,2+MATCH(H3,Fiestas,0))),\"\"),\"\")","v":""},{"$f":"IF(H3<>\"\",H3+1,IF(WEEKDAY($D$1)=5,$D$1,\"\"))","v":"2010-11-04"},{"$f":"IF(ISNUMBER(J3),IFERROR(INDIRECT(CONCATENATE(Fiesta,2+MATCH(J3,Fiestas,0))),\"\"),\"\")","v":""},{"$f":"IF(J3<>\"\",J3+1,IF(WEEKDAY($D$1)=6,$D$1,\"\"))","v":"2010-11-05"},{"$f":"IF(ISNUMBER(L3),IFERROR(INDIRECT(CONCATENATE(Fiesta,2+MATCH(L3,Fiestas,0))),\"\"),\"\")","v":""},{"$f":"IF(L3<>\"\",L3+1,IF(WEEKDAY($D$1)=7,$D$1,\"\"))","v":"2010-11-06"},{"$f":"IF(ISNUMBER(N3),IFERROR(INDIRECT(CONCATENATE(Fiesta,2+MATCH(N3,Fiestas,0))),\"\"),\"\")","v":""},{"$f":"IF(N3<>\"\",N3+1,IF(WEEKDAY($D$1)=1,$D$1,\"\"))","v":"2010-11-07"},{"$f":"IF(ISNUMBER(P3),IFERROR(INDIRECT(CONCATENATE(Fiesta,2+MATCH(P3,Fiestas,0))),\"\"),\"\")","v":""},{"$f":"IF(P3=\"\",\"\",WEEKNUM(P3,2))","v":45}]
[null,{"$f":"IF(ISNUMBER(B3),IFERROR(INDIRECT(CONCATENATE(Evento,1+MATCH(B3,Eventos,0))),\"\"),\"\")","v":""},null,{"$f":"IF(ISNUMBER(D3),IFERROR(INDIRECT(CONCATENATE(Evento,1+MATCH(D3,Eventos,0))),\"\"),\"\")","v":""},null,{"$f":"IF(ISNUMBER(F3),IFERROR(INDIRECT(CONCATENATE(Evento,1+MATCH(F3,Eventos,0))),\"\"),\"\")","v":""},null,{"$f":"IF(ISNUMBER(H3),IFERROR(INDIRECT(CONCATENATE(Evento,1+MATCH(H3,Eventos,0))),\"\"),\"\")","v":""},null,{"$f":"IF(ISNUMBER(J3),IFERROR(INDIRECT(CONCATENATE(Evento,1+MATCH(J3,Eventos,0))),\"\"),\"\")","v":""},null,{"$f":"IF(ISNUMBER(L3),IFERROR(INDIRECT(CONCATENATE(Evento,1+MATCH(L3,Eventos,0))),\"\"),\"\")","v":""},null,{"$f":"IF(ISNUMBER(N3),IFERROR(INDIRECT(CONCATENATE(Evento,1+MATCH(N3,Eventos,0))),\"\"),\"\")","v":""},null,{"$f":"IF(ISNUMBER(P3),IFERROR(INDIRECT(CONCATENATE(Evento,1+MATCH(P3,Eventos,0))),\"\"),\"\")","v":""}]
[null,{"$f":"IF(ISNUMBER(B3),IFERROR(INDIRECT(CONCATENATE(Agenda,1+MATCH(B3,Agendas,0))),\"\"),\"\")","v":""},null,{"$f":"IF(ISNUMBER(D3),IFERROR(INDIRECT(CONCATENATE(Agenda,1+MATCH(D3,Agendas,0))),\"\"),\"\")","v":""},null,{"$f":"IF(ISNUMBER(F3),IFERROR(INDIRECT(CONCATENATE(Agenda,1+MATCH(F3,Agendas,0))),\"\"),\"\")","v":""},null,{"$f":"IF(ISNUMBER(H3),IFERROR(INDIRECT(CONCATENATE(Agenda,1+MATCH(H3,Agendas,0))),\"\"),\"\")","v":""},null,{"$f":"IF(ISNUMBER(J3),IFERROR(INDIRECT(CONCATENATE(Agenda,1+MATCH(J3,Agendas,0))),\"\"),\"\")","v":""},null,{"$f":"IF(ISNUMBER(L3),IFERROR(INDIRECT(CONCATENATE(Agenda,1+MATCH(L3,Agendas,0))),\"\"),\"\")","v":""},null,{"$f":"IF(ISNUMBER(N3),IFERROR(INDIRECT(CONCATENATE(Agenda,1+MATCH(N3,Agendas,0))),\"\"),\"\")","v":""},null,{"$f":"IF(ISNUMBER(P3),IFERROR(INDIRECT(CONCATENATE(Agenda,1+MATCH(P3,Agendas,0))),\"\"),\"\")","v":""}]
[]
[]
[]
[{"$f":"WEEKNUM(B9,1)","v":46},{"$f":"P3","v":"2010-11-07"},{"$f":"IF(ISNUMBER(B9),IFERROR(INDIRECT(CONCATENATE(Fiesta,2+MATCH(B9,Fiestas,0))),\"\"),\"\")","v":""},{"$f":"P3+1","v":"2010-11-08"},{"$f":"IF(ISNUMBER(D9),IFERROR(INDIRECT(CONCATENATE(Fiesta,2+MATCH(D9,Fiestas,0))),\"\"),\"\")","v":""},{"$f":"D9+1","v":"2010-11-09"},{"$f":"IF(ISNUMBER(F9),IFERROR(INDIRECT(CONCATENATE(Fiesta,2+MATCH(F9,Fiestas,0))),\"\"),\"\")","v":""},{"$f":"F9+1","v":"2010-11-10"},{"$f":"IF(ISNUMBER(H9),IFERROR(INDIRECT(CONCATENATE(Fiesta,2+MATCH(H9,Fiestas,0))),\"\"),\"\")","v":""},{"$f":"H9+1","v":"2010-11-11"},{"$f":"IF(ISNUMBER(J9),IFERROR(INDIRECT(CONCATENATE(Fiesta,2+MATCH(J9,Fiestas,0))),\"\"),\"\")","v":"Veterans Day"},{"$f":"J9+1","v":"2010-11-12"},{"$f":"IF(ISNUMBER(L9),IFERROR(INDIRECT(CONCATENATE(Fiesta,2+MATCH(L9,Fiestas,0))),\"\"),\"\")","v":""},{"$f":"L9+1","v":"2010-11-13"},{"$f":"IF(ISNUMBER(N9),IFERROR(INDIRECT(CONCATENATE(Fiesta,2+MATCH(N9,Fiestas,0))),\"\"),\"\")","v":""},{"$f":"N9+1","v":"2010-11-14"},{"$f":"IF(ISNUMBER(P9),IFERROR(INDIRECT(CONCATENATE(Fiesta,2+MATCH(P9,Fiestas,0))),\"\"),\"\")","v":""},{"$f":"WEEKNUM(D9,2)","v":46}]
[null,{"$f":"IF(ISNUMBER(B9),IFERROR(INDIRECT(CONCATENATE(Evento,1+MATCH(B9,Eventos,0))),\"\"),\"\")","v":""},null,{"$f":"IF(ISNUMBER(D9),IFERROR(INDIRECT(CONCATENATE(Evento,1+MATCH(D9,Eventos,0))),\"\"),\"\")","v":""},null,{"$f":"IF(ISNUMBER(F9),IFERROR(INDIRECT(CONCATENATE(Evento,1+MATCH(F9,Eventos,0))),\"\"),\"\")","v":"World Freedom Day"},null,{"$f":"IF(ISNUMBER(H9),IFERROR(INDIRECT(CONCATENATE(Evento,1+MATCH(H9,Eventos,0))),\"\"),\"\")","v":""},null,{"$f":"IF(ISNUMBER(J9),IFERROR(INDIRECT(CONCATENATE(Evento,1+MATCH(J9,Eventos,0))),\"\"),\"\")","v":""},null,{"$f":"IF(ISNUMBER(L9),IFERROR(INDIRECT(CONCATENATE(Evento,1+MATCH(L9,Eventos,0))),\"\"),\"\")","v":""},null,{"$f":"IF(ISNUMBER(N9),IFERROR(INDIRECT(CONCATENATE(Evento,1+MATCH(N9,Eventos,0))),\"\"),\"\")","v":""},null,{"$f":"IF(ISNUMBER(P9),IFERROR(INDIRECT(CONCATENATE(Evento,1+MATCH(P9,Eventos,0))),\"\"),\"\")","v":"World Diabetes Day"}]
[null,{"$f":"IF(ISNUMBER(B9),IFERROR(INDIRECT(CONCATENATE(Agenda,1+MATCH(B9,Agendas,0))),\"\"),\"\")","v":""},null,{"$f":"IF(ISNUMBER(D9),IFERROR(INDIRECT(CONCATENATE(Agenda,1+MATCH(D9,Agendas,0))),\"\"),\"\")","v":""},null,{"$f":"IF(ISNUMBER(F9),IFERROR(INDIRECT(CONCATENATE(Agenda,1+MATCH(F9,Agendas,0))),\"\"),\"\")","v":""},null,{"$f":"IF(ISNUMBER(H9),IFERROR(INDIRECT(CONCATENATE(Agenda,1+MATCH(H9,Agendas,0))),\"\"),\"\")","v":""},null,{"$f":"IF(ISNUMBER(J9),IFERROR(INDIRECT(CONCATENATE(Agenda,1+MATCH(J9,Agendas,0))),\"\"),\"\")","v":""},null,{"$f":"IF(ISNUMBER(L9),IFERROR(INDIRECT(CONCATENATE(Agenda,1+MATCH(L9,Agendas,0))),\"\"),\"\")","v":""},null,{"$f":"IF(ISNUMBER(N9),IFERROR(INDIRECT(CONCATENATE(Agenda,1+MATCH(N9,Agendas,0))),\"\"),\"\")","v":""},null,{"$f":"IF(ISNUMBER(P9),IFERROR(INDIRECT(CONCATENATE(Agenda,1+MATCH(P9,Agendas,0))),\"\"),\"\")","v":""}]
[]
[]
[]
[{"$f":"WEEKNUM(B15,1)","v":47},{"$f":"P9","v":"2010-11-14"},{"$f":"IF(ISNUMBER(B15),IFERROR(INDIRECT(CONCATENATE(Fiesta,2+MATCH(B15,Fiestas,0))),\"\"),\"\")","v":""},{"$f":"P9+1","v":"2010-11-15"},{"$f":"IF(ISNUMBER(D15),IFERROR(INDIRECT(CONCATENATE(Fiesta,2+MATCH(D15,Fiestas,0))),\"\"),\"\")","v":""},{"$f":"D15+1","v":"2010-11-16"},{"$f":"IF(ISNUMBER(F15),IFERROR(INDIRECT(CONCATENATE(Fiesta,2+MATCH(F15,Fiestas,0))),\"\"),\"\")","v":""},{"$f":"F15+1","v":"2010-11-17"},{"$f":"IF(ISNUMBER(H15),IFERROR(INDIRECT(CONCATENATE(Fiesta,2+MATCH(H15,Fiestas,0))),\"\"),\"\")","v":""},{"$f":"H15+1","v":"2010-11-18"},{"$f":"IF(ISNUMBER(J15),IFERROR(INDIRECT(CONCATENATE(Fiesta,2+MATCH(J15,Fiestas,0))),\"\"),\"\")","v":""},{"$f":"J15+1","v":"2010-11-19"},{"$f":"IF(ISNUMBER(L15),IFERROR(INDIRECT(CONCATENATE(Fiesta,2+MATCH(L15,Fiestas,0))),\"\"),\"\")","v":""},{"$f":"L15+1","v":"2010-11-20"},{"$f":"IF(ISNUMBER(N15),IFERROR(INDIRECT(CONCATENATE(Fiesta,2+MATCH(N15,Fiestas,0))),\"\"),\"\")","v":""},{"$f":"N15+1","v":"2010-11-21"},{"$f":"IF(ISNUMBER(P15),IFERROR(INDIRECT(CONCATENATE(Fiesta,2+MATCH(P15,Fiestas,0))),\"\"),\"\")","v":""},{"$f":"WEEKNUM(D15,2)","v":47}]
[null,{"$f":"IF(ISNUMBER(B15),IFERROR(INDIRECT(CONCATENATE(Evento,1+MATCH(B15,Eventos,0))),\"\"),\"\")","v":"World Diabetes Day"},null,{"$f":"IF(ISNUMBER(D15),IFERROR(INDIRECT(CONCATENATE(Evento,1+MATCH(D15,Eventos,0))),\"\"),\"\")","v":""},null,{"$f":"IF(ISNUMBER(F15),IFERROR(INDIRECT(CONCATENATE(Evento,1+MATCH(F15,Eventos,0))),\"\"),\"\")","v":"International Day for Tolerance"},null,{"$f":"IF(ISNUMBER(H15),IFERROR(INDIRECT(CONCATENATE(Evento,1+MATCH(H15,Eventos,0))),\"\"),\"\")","v":""},null,{"$f":"IF(ISNUMBER(J15),IFERROR(INDIRECT(CONCATENATE(Evento,1+MATCH(J15,Eventos,0))),\"\"),\"\")","v":""},null,{"$f":"IF(ISNUMBER(L15),IFERROR(INDIRECT(CONCATENATE(Evento,1+MATCH(L15,Eventos,0))),\"\"),\"\")","v":"World Toilet Day"},null,{"$f":"IF(ISNUMBER(N15),IFERROR(INDIRECT(CONCATENATE(Evento,1+MATCH(N15,Eventos,0))),\"\"),\"\")","v":"Africa Industrialization Day"},null,{"$f":"IF(ISNUMBER(P15),IFERROR(INDIRECT(CONCATENATE(Evento,1+MATCH(P15,Eventos,0))),\"\"),\"\")","v":"World Television Day"}]
[null,{"$f":"IF(ISNUMBER(B15),IFERROR(INDIRECT(CONCATENATE(Agenda,1+MATCH(B15,Agendas,0))),\"\"),\"\")","v":""},null,{"$f":"IF(ISNUMBER(D15),IFERROR(INDIRECT(CONCATENATE(Agenda,1+MATCH(D15,Agendas,0))),\"\"),\"\")","v":""},null,{"$f":"IF(ISNUMBER(F15),IFERROR(INDIRECT(CONCATENATE(Agenda,1+MATCH(F15,Agendas,0))),\"\"),\"\")","v":""},null,{"$f":"IF(ISNUMBER(H15),IFERROR(INDIRECT(CONCATENATE(Agenda,1+MATCH(H15,Agendas,0))),\"\"),\"\")","v":""},null,{"$f":"IF(ISNUMBER(J15),IFERROR(INDIRECT(CONCATENATE(Agenda,1+MATCH(J15,Agendas,0))),\"\"),\"\")","v":""},null,{"$f":"IF(ISNUMBER(L15),IFERROR(INDIRECT(CONCATENATE(Agenda,1+MATCH(L15,Agendas,0))),\"\"),\"\")","v":""},null,{"$f":"IF(ISNUMBER(N15),IFERROR(INDIRECT(CONCATENATE(Agenda,1+MATCH(N15,Agendas,0))),\"\"),\"\")","v":""},null,{"$f":"IF(ISNUMBER(P15),IFERROR(INDIRECT(CONCATENATE(Agenda,1+MATCH(P15,Agendas,0))),\"\"),\"\")","v":""}]
[]
[]
[]
[{"$f":"WEEKNUM(B21,1)","v":48},{"$f":"P15","v":"2010-11-21"},{"$f":"IF(ISNUMBER(B21),IFERROR(INDIRECT(CONCATENATE(Fiesta,2+MATCH(B21,Fiestas,0))),\"\"),\"\")","v":""},{"$f":"P15+1","v":"2010-11-22"},{"$f":"IF(ISNUMBER(D21),IFERROR(INDIRECT(CONCATENATE(Fiesta,2+MATCH(D21,Fiestas,0))),\"\"),\"\")","v":""},{"$f":"D21+1","v":"2010-11-23"},{"$f":"IF(ISNUMBER(F21),IFERROR(INDIRECT(CONCATENATE(Fiesta,2+MATCH(F21,Fiestas,0))),\"\"),\"\")","v":""},{"$f":"F21+1","v":"2010-11-24"},{"$f":"IF(ISNUMBER(H21),IFERROR(INDIRECT(CONCATENATE(Fiesta,2+MATCH(H21,Fiestas,0))),\"\"),\"\")","v":""},{"$f":"H21+1","v":"2010-11-25"},{"$f":"IF(ISNUMBER(J21),IFERROR(INDIRECT(CONCATENATE(Fiesta,2+MATCH(J21,Fiestas,0))),\"\"),\"\")","v":"Thanksgiving Day"},{"$f":"J21+1","v":"2010-11-26"},{"$f":"IF(ISNUMBER(L21),IFERROR(INDIRECT(CONCATENATE(Fiesta,2+MATCH(L21,Fiestas,0))),\"\"),\"\")","v":""},{"$f":"L21+1","v":"2010-11-27"},{"$f":"IF(ISNUMBER(N21),IFERROR(INDIRECT(CONCATENATE(Fiesta,2+MATCH(N21,Fiestas,0))),\"\"),\"\")","v":""},{"$f":"N21+1","v":"2010-11-28"},{"$f":"IF(ISNUMBER(P21),IFERROR(INDIRECT(CONCATENATE(Fiesta,2+MATCH(P21,Fiestas,0))),\"\"),\"\")","v":""},{"$f":"WEEKNUM(D21,2)","v":48}]
[null,{"$f":"IF(ISNUMBER(B21),IFERROR(INDIRECT(CONCATENATE(Evento,1+MATCH(B21,Eventos,0))),\"\"),\"\")","v":"World Television Day"},null,{"$f":"IF(ISNUMBER(D21),IFERROR(INDIRECT(CONCATENATE(Evento,1+MATCH(D21,Eventos,0))),\"\"),\"\")","v":""},null,{"$f":"IF(ISNUMBER(F21),IFERROR(INDIRECT(CONCATENATE(Evento,1+MATCH(F21,Eventos,0))),\"\"),\"\")","v":""},null,{"$f":"IF(ISNUMBER(H21),IFERROR(INDIRECT(CONCATENATE(Evento,1+MATCH(H21,Eventos,0))),\"\"),\"\")","v":""},null,{"$f":"IF(ISNUMBER(J21),IFERROR(INDIRECT(CONCATENATE(Evento,1+MATCH(J21,Eventos,0))),\"\"),\"\")","v":"International Day for the Elimination of Violence against Women"},null,{"$f":"IF(ISNUMBER(L21),IFERROR(INDIRECT(CONCATENATE(Evento,1+MATCH(L21,Eventos,0))),\"\"),\"\")","v":""},null,{"$f":"IF(ISNUMBER(N21),IFERROR(INDIRECT(CONCATENATE(Evento,1+MATCH(N21,Eventos,0))),\"\"),\"\")","v":""},null,{"$f":"IF(ISNUMBER(P21),IFERROR(INDIRECT(CONCATENATE(Evento,1+MATCH(P21,Eventos,0))),\"\"),\"\")","v":""}]
[null,{"$f":"IF(ISNUMBER(B21),IFERROR(INDIRECT(CONCATENATE(Agenda,1+MATCH(B21,Agendas,0))),\"\"),\"\")","v":""},null,{"$f":"IF(ISNUMBER(D21),IFERROR(INDIRECT(CONCATENATE(Agenda,1+MATCH(D21,Agendas,0))),\"\"),\"\")","v":""},null,{"$f":"IF(ISNUMBER(F21),IFERROR(INDIRECT(CONCATENATE(Agenda,1+MATCH(F21,Agendas,0))),\"\"),\"\")","v":""},null,{"$f":"IF(ISNUMBER(H21),IFERROR(INDIRECT(CONCATENATE(Agenda,1+MATCH(H21,Agendas,0))),\"\"),\"\")","v":""},null,{"$f":"IF(ISNUMBER(J21),IFERROR(INDIRECT(CONCATENATE(Agenda,1+MATCH(J21,Agendas,0))),\"\"),\"\")","v":""},null,{"$f":"IF(ISNUMBER(L21),IFERROR(INDIRECT(CONCATENATE(Agenda,1+MATCH(L21,Agendas,0))),\"\"),\"\")","v":""},null,{"$f":"IF(ISNUMBER(N21),IFERROR(INDIRECT(CONCATENATE(Agenda,1+MATCH(N21,Agendas,0))),\"\"),\"\")","v":""},null,{"$f":"IF(ISNUMBER(P21),IFERROR(INDIRECT(CONCATENATE(Agenda,1+MATCH(P21,Agendas,0))),\"\"),\"\")","v":""}]
[]
[]
[]
[{"$f":"IF(B27=\"\",\"\",WEEKNUM(B27,1))","v":49},{"$f":"P21","v":"2010-11-28"},{"$f":"IF(ISNUMBER(B27),IFERROR(INDIRECT(CONCATENATE(Fiesta,2+MATCH(B27,Fiestas,0))),\"\"),\"\")","v":""},{"$f":"IF(P21<EOMONTH($D$1,0),P21+1,\"\")","v":"2010-11-29"},{"$f":"IF(ISNUMBER(D27),IFERROR(INDIRECT(CONCATENATE(Fiesta,2+MATCH(D27,Fiestas,0))),\"\"),\"\")","v":""},{"$f":"IF(D27<EOMONTH($D$1,0),D27+1,\"\")","v":"2010-11-30"},{"$f":"IF(ISNUMBER(F27),IFERROR(INDIRECT(CONCATENATE(Fiesta,2+MATCH(F27,Fiestas,0))),\"\"),\"\")","v":""},{"$f":"IF(F27<EOMONTH($D$1,0),F27+1,\"\")","v":""},{"$f":"IF(ISNUMBER(H27),IFERROR(INDIRECT(CONCATENATE(Fiesta,2+MATCH(H27,Fiestas,0))),\"\"),\"\")","v":""},{"$f":"IF(H27<EOMONTH($D$1,0),H27+1,\"\")","v":""},{"$f":"IF(ISNUMBER(J27),IFERROR(INDIRECT(CONCATENATE(Fiesta,2+MATCH(J27,Fiestas,0))),\"\"),\"\")","v":""},{"$f":"IF(J27<EOMONTH($D$1,0),J27+1,\"\")","v":""},{"$f":"IF(ISNUMBER(L27),IFERROR(INDIRECT(CONCATENATE(Fiesta,2+MATCH(L27,Fiestas,0))),\"\"),\"\")","v":""},{"$f":"IF(L27<EOMONTH($D$1,0),L27+1,\"\")","v":""},{"$f":"IF(ISNUMBER(N27),IFERROR(INDIRECT(CONCATENATE(Fiesta,2+MATCH(N27,Fiestas,0))),\"\"),\"\")","v":""},{"$f":"IF(N27<EOMONTH($D$1,0),N27+1,\"\")","v":""},{"$f":"IF(ISNUMBER(P27),IFERROR(INDIRECT(CONCATENATE(Fiesta,2+MATCH(P27,Fiestas,0))),\"\"),\"\")","v":""},{"$f":"IF(D27=\"\",\"\",WEEKNUM(D27,2))","v":49}]
[null,{"$f":"IF(ISNUMBER(B27),IFERROR(INDIRECT(CONCATENATE(Evento,1+MATCH(B27,Eventos,0))),\"\"),\"\")","v":""},null,{"$f":"IF(ISNUMBER(D27),IFERROR(INDIRECT(CONCATENATE(Evento,1+MATCH(D27,Eventos,0))),\"\"),\"\")","v":"International Day of Solidarity with the Palestinian People"},null,{"$f":"IF(ISNUMBER(F27),IFERROR(INDIRECT(CONCATENATE(Evento,1+MATCH(F27,Eventos,0))),\"\"),\"\")","v":"Computer Security Day"},null,{"$f":"IF(ISNUMBER(H27),IFERROR(INDIRECT(CONCATENATE(Evento,1+MATCH(H27,Eventos,0))),\"\"),\"\")","v":""},null,{"$f":"IF(ISNUMBER(J27),IFERROR(INDIRECT(CONCATENATE(Evento,1+MATCH(J27,Eventos,0))),\"\"),\"\")","v":""},null,{"$f":"IF(ISNUMBER(L27),IFERROR(INDIRECT(CONCATENATE(Evento,1+MATCH(L27,Eventos,0))),\"\"),\"\")","v":""},null,{"$f":"IF(ISNUMBER(N27),IFERROR(INDIRECT(CONCATENATE(Evento,1+MATCH(N27,Eventos,0))),\"\"),\"\")","v":""},null,{"$f":"IF(ISNUMBER(P27),IFERROR(INDIRECT(CONCATENATE(Evento,1+MATCH(P27,Eventos,0))),\"\"),\"\")","v":""}]
[null,{"$f":"IF(ISNUMBER(B27),IFERROR(INDIRECT(CONCATENATE(Agenda,1+MATCH(B27,Agendas,0))),\"\"),\"\")","v":""},null,{"$f":"IF(ISNUMBER(D27),IFERROR(INDIRECT(CONCATENATE(Agenda,1+MATCH(D27,Agendas,0))),\"\"),\"\")","v":""},null,{"$f":"IF(ISNUMBER(F27),IFERROR(INDIRECT(CONCATENATE(Agenda,1+MATCH(F27,Agendas,0))),\"\"),\"\")","v":""},null,{"$f":"IF(ISNUMBER(H27),IFERROR(INDIRECT(CONCATENATE(Agenda,1+MATCH(H27,Agendas,0))),\"\"),\"\")","v":""},null,{"$f":"IF(ISNUMBER(J27),IFERROR(INDIRECT(CONCATENATE(Agenda,1+MATCH(J27,Agendas,0))),\"\"),\"\")","v":""},null,{"$f":"IF(ISNUMBER(L27),IFERROR(INDIRECT(CONCATENATE(Agenda,1+MATCH(L27,Agendas,0))),\"\"),\"\")","v":""},null,{"$f":"IF(ISNUMBER(N27),IFERROR(INDIRECT(CONCATENATE(Agenda,1+MATCH(N27,Agendas,0))),\"\"),\"\")","v":""},null,{"$f":"IF(ISNUMBER(P27),IFERROR(INDIRECT(CONCATENATE(Agenda,1+MATCH(P27,Agendas,0))),\"\"),\"\")","v":""}]
[]
[]
[]
[{"$f":"IF(B33=\"\",\"\",WEEKNUM(B33,1))","v":""},{"$f":"P27","v":""},{"$f":"IF(ISNUMBER(B33),IFERROR(INDIRECT(CONCATENATE(Fiesta,2+MATCH(B33,Fiestas,0))),\"\"),\"\")","v":""},{"$f":"IF(P27<EOMONTH($D$1,0),P27+1,\"\")","v":""},{"$f":"IF(ISNUMBER(D33),IFERROR(INDIRECT(CONCATENATE(Fiesta,2+MATCH(D33,Fiestas,0))),\"\"),\"\")","v":""},{"$f":"IF(D33<EOMONTH($D$1,0),D33+1,\"\")","v":""},{"$f":"IF(ISNUMBER(F33),IFERROR(INDIRECT(CONCATENATE(Fiesta,2+MATCH(F33,Fiestas,0))),\"\"),\"\")","v":""},"Notes:",null,null,null,null,null,null,null,null,null,{"$f":"IF(D33=\"\",\"\",WEEKNUM(D33,2))","v":""}]
[null,{"$f":"IF(ISNUMBER(B33),IFERROR(INDIRECT(CONCATENATE(Evento,1+MATCH(B33,Eventos,0))),\"\"),\"\")","v":""},null,{"$f":"IF(ISNUMBER(D33),IFERROR(INDIRECT(CONCATENATE(Evento,1+MATCH(D33,Eventos,0))),\"\"),\"\")","v":""},null,{"$f":"IF(ISNUMBER(F33),IFERROR(INDIRECT(CONCATENATE(Evento,1+MATCH(F33,Eventos,0))),\"\"),\"\")","v":""}]
[null,{"$f":"IF(ISNUMBER(B33),IFERROR(INDIRECT(CONCATENATE(Agenda,1+MATCH(B33,Agendas,0))),\"\"),\"\")","v":""},null,{"$f":"IF(ISNUMBER(D33),IFERROR(INDIRECT(CONCATENATE(Agenda,1+MATCH(D33,Agendas,0))),\"\"),\"\")","v":""},null,{"$f":"IF(ISNUMBER(F33),IFERROR(INDIRECT(CONCATENATE(Agenda,1+MATCH(F33,Agendas,0))),\"\"),\"\")","v":""}]

{"sheet":"Dec","index":15,"n_rows":35,"n_cols":18,"rows_kept":35,"cut":false,"hidden":false,"merged":[[36,7,36,8],[36,9,36,10],[36,11,36,12],[37,7,37,8],[37,9,37,10],[37,11,37,12],[36,13,36,16],[37,13,37,16],[34,7,34,8],[34,9,34,10],[34,11,34,12],[34,13,34,14],[34,15,34,16],[35,7,35,8],[35,9,35,10],[35,11,35,12],[35,13,35,14],[35,15,35,16],[37,1,37,2],[37,3,37,4],[37,5,37,6],[36,1,36,2],[36,3,36,4],[36,5,36,6],[35,1,35,2],[35,3,35,4],[35,5,35,6],[34,1,34,2],[34,3,34,4],[34,5,34,6],[31,11,31,12],[31,13,31,14],[31,15,31,16],[33,1,33,2],[33,3,33,4],[33,5,33,6],[31,1,31,2],[31,3,31,4],[31,5,31,6],[31,7,31,8],[31,9,31,10],[32,7,32,8],[32,9,32,10],[32,11,32,12],[32,13,32,14],[32,15,32,16],[33,7,33,8],[33,9,33,10],[33,11,33,12],[33,13,33,14],[33,15,33,16],[29,11,29,12],[29,13,29,14],[29,15,29,16],[30,1,30,2],[30,3,30,4],[30,5,30,6],[30,7,30,8],[30,9,30,10],[30,11,30,12],[30,13,30,14],[30,15,30,16],[29,1,29,2],[29,3,29,4],[29,5,29,6],[29,7,29,8],[29,9,29,10],[27,11,27,12],[27,13,27,14],[27,15,27,16],[28,1,28,2],[28,3,28,4],[28,5,28,6],[28,7,28,8],[28,9,28,10],[28,11,28,12],[28,13,28,14],[28,15,28,16],[27,1,27,2],[27,3,27,4],[27,5,27,6],[27,7,27,8],[27,9,27,10],[24,11,24,12],[24,13,24,14],[24,15,24,16],[25,1,25,2],[25,3,25,4],[25,5,25,6],[25,7,25,8],[25,9,25,10],[25,11,25,12],[25,13,25,14],[25,15,25,16],[24,1,24,2],[24,3,24,4],[24,5,24,6],[24,7,24,8],[24,9,24,10],[22,11,22,12],[22,13,22,14],[22,15,22,16],[23,1,23,2],[23,3,23,4],[23,5,23,6],[23,7,23,8],[23,9,23,10],[23,11,23,12],[23,13,23,14],[23,15,23,16],[22,1,22,2],[22,3,22,4],[22,5,22,6],[22,7,22,8],[22,9,22,10],[19,11,19,12],[19,13,19,14],[19,15,19,16],[21,1,21,2],[21,3,21,4],[21,5,21,6],[21,7,21,8],[21,9,21,10],[21,11,21,12],[21,13,21,14],[21,15,21,16],[19,1,19,2],[19,3,19,4],[19,5,19,6],[19,7,19,8],[19,9,19,10],[17,11,17,12],[17,13,17,14],[17,15,17,16],[18,1,18,2],[18,3,18,4],[18,5,18,6],[18,7,18,8],[18,9,18,10],[18,11,18,12],[18,13,18,14],[18,15,18,16],[17,1,17,2],[17,3,17,4],[17,5,17,6],[17,7,17,8],[17,9,17,10],[15,11,15,12],[15,13,15,14],[15,15,15,16],[16,1,16,2],[16,3,16,4],[16,5,16,6],[16,7,16,8],[16,9,16,10],[16,11,16,12],[16,13,16,14],[16,15,16,16],[15,1,15,2],[15,3,15,4],[15,5,15,6],[15,7,15,8],[15,9,15,10],[12,11,12,12],[12,13,12,14],[12,15,12,16],[13,1,13,2],[13,3,13,4],[13,5,13,6],[13,7,13,8],[13,9,13,10],[13,11,13,12],[13,13,13,14],[13,15,13,16],[12,1,12,2],[12,3,12,4],[12,5,12,6],[12,7,12,8],[12,9,12,10],[10,11,10,12],[10,13,10,14],[10,15,10,16],[11,1,11,2],[11,3,11,4],[11,5,11,6],[11,7,11,8],[11,9,11,10],[11,11,11,12],[11,13,11,14],[11,15,11,16],[10,1,10,2],[10,3,10,4],[10,5,10,6],[10,7,10,8],[10,9,10,10],[7,11,7,12],[7,13,7,14],[7,15,7,16],[9,1,9,2],[9,3,9,4],[9,5,9,6],[9,7,9,8],[9,9,9,10],[9,11,9,12],[9,13,9,14],[9,15,9,16],[7,1,7,2],[7,3,7,4],[7,5,7,6],[7,7,7,8],[7,9,7,10],[5,11,5,12],[5,13,5,14],[5,15,5,16],[6,1,6,2],[6,3,6,4],[6,5,6,6],[6,7,6,8],[6,9,6,10],[6,11,6,12],[6,13,6,14],[6,15,6,16],[5,1,5,2],[5,3,5,4],[5,5,5,6],[5,7,5,8],[5,9,5,10],[0,9,0,11],[1,1,1,2],[1,3,1,4],[1,5,1,6],[1,7,1,8],[1,9,1,10],[1,11,1,12],[1,13,1,14],[0,3,0,8],[1,15,1,16],[3,11,3,12],[3,13,3,14],[3,15,3,16],[4,1,4,2],[4,3,4,4],[4,5,4,6],[4,7,4,8],[4,9,4,10],[4,11,4,12],[4,13,4,14],[4,15,4,16],[3,1,3,2],[3,3,3,4],[3,5,3,6],[3,7,3,8],[3,9,3,10]]}
[null,null,null,{"$f":"DATE(Cal!M3,12,1)","v":"2010-12-01"},null,null,null,null,null,{"$f":"Cal!$M$3","v":2010}]
[null,{"$f":"DATE(2010,2,7)","v":"2010-02-07"},null,{"$f":"DATE(2010,2,1)","v":"2010-02-01"},null,{"$f":"DATE(2010,2,2)","v":"2010-02-02"},null,{"$f":"DATE(2010,2,3)","v":"2010-02-03"},null,{"$f":"DATE(2010,2,4)","v":"2010-02-04"},null,{"$f":"DATE(2010,2,5)","v":"2010-02-05"},null,{"$f":"DATE(2010,2,6)","v":"2010-02-06"},null,{"$f":"DATE(2010,2,7)","v":"2010-02-07"}]
[{"$f":"IF(N3=\"\",\"\",WEEKNUM(N3,1))","v":49},null,{"$f":"IF(ISNUMBER(B3),IFERROR(INDIRECT(CONCATENATE(Fiesta,2+MATCH(B3,Fiestas,0))),\"\"),\"\")","v":""},{"$f":"IF(WEEKDAY($D$1)=2,$D$1,\"\")","v":""},{"$f":"IF(ISNUMBER(D3),IFERROR(INDIRECT(CONCATENATE(Fiesta,2+MATCH(D3,Fiestas,0))),\"\"),\"\")","v":""},{"$f":"IF(D3<>\"\",D3+1,IF(WEEKDAY($D$1)=3,$D$1,\"\"))","v":""},{"$f":"IF(ISNUMBER(F3),IFERROR(INDIRECT(CONCATENATE(Fiesta,2+MATCH(F3,Fiestas,0))),\"\"),\"\")","v":""},{"$f":"IF(F3<>\"\",F3+1,IF(WEEKDAY($D$1)=4,$D$1,\"\"))","v":"2010-12-01"},{"$f":"IF(ISNUMBER(H3),IFERROR(INDIRECT(CONCATENATE(Fiesta,2+MATCH(H3,Fiestas,0))),\"\"),\"\")","v":""},{"$f":"IF(H3<>\"\",H3+1,IF(WEEKDAY($D$1)=5,$D$1,\"\"))","v":"2010-12-02"},{"$f":"IF(ISNUMBER(J3),IFERROR(INDIRECT(CONCATENATE(Fiesta,2+MATCH(J3,Fiestas,0))),\"\"),\"\")","v":""},{"$f":"IF(J3<>\"\",J3+1,IF(WEEKDAY($D$1)=6,$D$1,\"\"))","v":"2010-12-03"},{"$f":"IF(ISNUMBER(L3),IFERROR(INDIRECT(CONCATENATE(Fiesta,2+MATCH(L3,Fiestas,0))),\"\"),\"\")","v":""},{"$f":"IF(L3<>\"\",L3+1,IF(WEEKDAY($D$1)=7,$D$1,\"\"))","v":"2010-12-04"},{"$f":"IF(ISNUMBER(N3),IFERROR(INDIRECT(CONCATENATE(Fiesta,2+MATCH(N3,Fiestas,0))),\"\"),\"\")","v":""},{"$f":"IF(N3<>\"\",N3+1,IF(WEEKDAY($D$1)=1,$D$1,\"\"))","v":"2010-12-05"},{"$f":"IF(ISNUMBER(P3),IFERROR(INDIRECT(CONCATENATE(Fiesta,2+MATCH(P3,Fiestas,0))),\"\"),\"\")","v":""},{"$f":"IF(P3=\"\",\"\",WEEKNUM(P3,2))","v":49}]
[null,{"$f":"IF(ISNUMBER(B3),IFERROR(INDIRECT(CONCATENATE(Evento,1+MATCH(B3,Eventos,0))),\"\"),\"\")","v":""},null,{"$f":"IF(ISNUMBER(D3),IFERROR(INDIRECT(CONCATENATE(Evento,1+MATCH(D3,Eventos,0))),\"\"),\"\")","v":""},null,{"$f":"IF(ISNUMBER(F3),IFERROR(INDIRECT(CONCATENATE(Evento,1+MATCH(F3,Eventos,0))),\"\"),\"\")","v":""},null,{"$f":"IF(ISNUMBER(H3),IFERROR(INDIRECT(CONCATENATE(Evento,1+MATCH(H3,Eventos,0))),\"\"),\"\")","v":"World Aids Day"},null,{"$f":"IF(ISNUMBER(J3),IFERROR(INDIRECT(CONCATENATE(Evento,1+MATCH(J3,Eventos,0))),\"\"),\"\")","v":"International Day for the Abolition of Slavery"},null,{"$f":"IF(ISNUMBER(L3),IFERROR(INDIRECT(CONCATENATE(Evento,1+MATCH(L3,Eventos,0))),\"\"),\"\")","v":"International Day of Persons with Disabilities"},null,{"$f":"IF(ISNUMBER(N3),IFERROR(INDIRECT(CONCATENATE(Evento,1+MATCH(N3,Eventos,0))),\"\"),\"\")","v":""},null,{"$f":"IF(ISNUMBER(P3),IFERROR(INDIRECT(CONCATENATE(Evento,1+MATCH(P3,Eventos,0))),\"\"),\"\")","v":"International Volunteer Day for Economic and Social Development"}]
[null,{"$f":"IF(ISNUMBER(B3),IFERROR(INDIRECT(CONCATENATE(Agenda,1+MATCH(B3,Agendas,0))),\"\"),\"\")","v":""},null,{"$f":"IF(ISNUMBER(D3),IFERROR(INDIRECT(CONCATENATE(Agenda,1+MATCH(D3,Agendas,0))),\"\"),\"\")","v":""},null,{"$f":"IF(ISNUMBER(F3),IFERROR(INDIRECT(CONCATENATE(Agenda,1+MATCH(F3,Agendas,0))),\"\"),\"\")","v":""},null,{"$f":"IF(ISNUMBER(H3),IFERROR(INDIRECT(CONCATENATE(Agenda,1+MATCH(H3,Agendas,0))),\"\"),\"\")","v":""},null,{"$f":"IF(ISNUMBER(J3),IFERROR(INDIRECT(CONCATENATE(Agenda,1+MATCH(J3,Agendas,0))),\"\"),\"\")","v":""},null,{"$f":"IF(ISNUMBER(L3),IFERROR(INDIRECT(CONCATENATE(Agenda,1+MATCH(L3,Agendas,0))),\"\"),\"\")","v":""},null,{"$f":"IF(ISNUMBER(N3),IFERROR(INDIRECT(CONCATENATE(Agenda,1+MATCH(N3,Agendas,0))),\"\"),\"\")","v":""},null,{"$f":"IF(ISNUMBER(P3),IFERROR(INDIRECT(CONCATENATE(Agenda,1+MATCH(P3,Agendas,0))),\"\"),\"\")","v":""}]
[]
[]
[]
[{"$f":"WEEKNUM(B9,1)","v":50},{"$f":"P3","v":"2010-12-05"},{"$f":"IF(ISNUMBER(B9),IFERROR(INDIRECT(CONCATENATE(Fiesta,2+MATCH(B9,Fiestas,0))),\"\"),\"\")","v":""},{"$f":"P3+1","v":"2010-12-06"},{"$f":"IF(ISNUMBER(D9),IFERROR(INDIRECT(CONCATENATE(Fiesta,2+MATCH(D9,Fiestas,0))),\"\"),\"\")","v":""},{"$f":"D9+1","v":"2010-12-07"},{"$f":"IF(ISNUMBER(F9),IFERROR(INDIRECT(CONCATENATE(Fiesta,2+MATCH(F9,Fiestas,0))),\"\"),\"\")","v":""},{"$f":"F9+1","v":"2010-12-08"},{"$f":"IF(ISNUMBER(H9),IFERROR(INDIRECT(CONCATENATE(Fiesta,2+MATCH(H9,Fiestas,0))),\"\"),\"\")","v":""},{"$f":"H9+1","v":"2010-12-09"},{"$f":"IF(ISNUMBER(J9),IFERROR(INDIRECT(CONCATENATE(Fiesta,2+MATCH(J9,Fiestas,0))),\"\"),\"\")","v":""},{"$f":"J9+1","v":"2010-12-10"},{"$f":"IF(ISNUMBER(L9),IFERROR(INDIRECT(CONCATENATE(Fiesta,2+MATCH(L9,Fiestas,0))),\"\"),\"\")","v":""},{"$f":"L9+1","v":"2010-12-11"},{"$f":"IF(ISNUMBER(N9),IFERROR(INDIRECT(CONCATENATE(Fiesta,2+MATCH(N9,Fiestas,0))),\"\"),\"\")","v":""},{"$f":"N9+1","v":"2010-12-12"},{"$f":"IF(ISNUMBER(P9),IFERROR(INDIRECT(CONCATENATE(Fiesta,2+MATCH(P9,Fiestas,0))),\"\"),\"\")","v":""},{"$f":"WEEKNUM(D9,2)","v":50}]
[null,{"$f":"IF(ISNUMBER(B9),IFERROR(INDIRECT(CONCATENATE(Evento,1+MATCH(B9,Eventos,0))),\"\"),\"\")","v":"International Volunteer Day for Economic and Social Development"},null,{"$f":"IF(ISNUMBER(D9),IFERROR(INDIRECT(CONCATENATE(Evento,1+MATCH(D9,Eventos,0))),\"\"),\"\")","v":""},null,{"$f":"IF(ISNUMBER(F9),IFERROR(INDIRECT(CONCATENATE(Evento,1+MATCH(F9,Eventos,0))),\"\"),\"\")","v":"International Civil Aviation Day"},null,{"$f":"IF(ISNUMBER(H9),IFERROR(INDIRECT(CONCATENATE(Evento,1+MATCH(H9,Eventos,0))),\"\"),\"\")","v":""},null,{"$f":"IF(ISNUMBER(J9),IFERROR(INDIRECT(CONCATENATE(Evento,1+MATCH(J9,Eventos,0))),\"\"),\"\")","v":"The International Day against Corruption"},null,{"$f":"IF(ISNUMBER(L9),IFERROR(INDIRECT(CONCATENATE(Evento,1+MATCH(L9,Eventos,0))),\"\"),\"\")","v":"Human Rights Day"},null,{"$f":"IF(ISNUMBER(N9),IFERROR(INDIRECT(CONCATENATE(Evento,1+MATCH(N9,Eventos,0))),\"\"),\"\")","v":""},null,{"$f":"IF(ISNUMBER(P9),IFERROR(INDIRECT(CONCATENATE(Evento,1+MATCH(P9,Eventos,0))),\"\"),\"\")","v":""}]
[null,{"$f":"IF(ISNUMBER(B9),IFERROR(INDIRECT(CONCATENATE(Agenda,1+MATCH(B9,Agendas,0))),\"\"),\"\")","v":""},null,{"$f":"IF(ISNUMBER(D9),IFERROR(INDIRECT(CONCATENATE(Agenda,1+MATCH(D9,Agendas,0))),\"\"),\"\")","v":""},null,{"$f":"IF(ISNUMBER(F9),IFERROR(INDIRECT(CONCATENATE(Agenda,1+MATCH(F9,Agendas,0))),\"\"),\"\")","v":""},null,{"$f":"IF(ISNUMBER(H9),IFERROR(INDIRECT(CONCATENATE(Agenda,1+MATCH(H9,Agendas,0))),\"\"),\"\")","v":""},null,{"$f":"IF(ISNUMBER(J9),IFERROR(INDIRECT(CONCATENATE(Agenda,1+MATCH(J9,Agendas,0))),\"\"),\"\")","v":""},null,{"$f":"IF(ISNUMBER(L9),IFERROR(INDIRECT(CONCATENATE(Agenda,1+MATCH(L9,Agendas,0))),\"\"),\"\")","v":""},null,{"$f":"IF(ISNUMBER(N9),IFERROR(INDIRECT(CONCATENATE(Agenda,1+MATCH(N9,Agendas,0))),\"\"),\"\")","v":""},null,{"$f":"IF(ISNUMBER(P9),IFERROR(INDIRECT(CONCATENATE(Agenda,1+MATCH(P9,Agendas,0))),\"\"),\"\")","v":""}]
[]
[]
[]
[{"$f":"WEEKNUM(B15,1)","v":51},{"$f":"P9","v":"2010-12-12"},{"$f":"IF(ISNUMBER(B15),IFERROR(INDIRECT(CONCATENATE(Fiesta,2+MATCH(B15,Fiestas,0))),\"\"),\"\")","v":""},{"$f":"P9+1","v":"2010-12-13"},{"$f":"IF(ISNUMBER(D15),IFERROR(INDIRECT(CONCATENATE(Fiesta,2+MATCH(D15,Fiestas,0))),\"\"),\"\")","v":""},{"$f":"D15+1","v":"2010-12-14"},{"$f":"IF(ISNUMBER(F15),IFERROR(INDIRECT(CONCATENATE(Fiesta,2+MATCH(F15,Fiestas,0))),\"\"),\"\")","v":""},{"$f":"F15+1","v":"2010-12-15"},{"$f":"IF(ISNUMBER(H15),IFERROR(INDIRECT(CONCATENATE(Fiesta,2+MATCH(H15,Fiestas,0))),\"\"),\"\")","v":""},{"$f":"H15+1","v":"2010-12-16"},{"$f":"IF(ISNUMBER(J15),IFERROR(INDIRECT(CONCATENATE(Fiesta,2+MATCH(J15,Fiestas,0))),\"\"),\"\")","v":""},{"$f":"J15+1","v":"2010-12-17"},{"$f":"IF(ISNUMBER(L15),IFERROR(INDIRECT(CONCATENATE(Fiesta,2+MATCH(L15,Fiestas,0))),\"\"),\"\")","v":""},{"$f":"L15+1","v":"2010-12-18"},{"$f":"IF(ISNUMBER(N15),IFERROR(INDIRECT(CONCATENATE(Fiesta,2+MATCH(N15,Fiestas,0))),\"\"),\"\")","v":""},{"$f":"N15+1","v":"2010-12-19"},{"$f":"IF(ISNUMBER(P15),IFERROR(INDIRECT(CONCATENATE(Fiesta,2+MATCH(P15,Fiestas,0))),\"\"),\"\")","v":""},{"$f":"WEEKNUM(D15,2)","v":51}]
[null,{"$f":"IF(ISNUMBER(B15),IFERROR(INDIRECT(CONCATENATE(Evento,1+MATCH(B15,Eventos,0))),\"\"),\"\")","v":""},null,{"$f":"IF(ISNUMBER(D15),IFERROR(INDIRECT(CONCATENATE(Evento,1+MATCH(D15,Eventos,0))),\"\"),\"\")","v":""},null,{"$f":"IF(ISNUMBER(F15),IFERROR(INDIRECT(CONCATENATE(Evento,1+MATCH(F15,Eventos,0))),\"\"),\"\")","v":""},null,{"$f":"IF(ISNUMBER(H15),IFERROR(INDIRECT(CONCATENATE(Evento,1+MATCH(H15,Eventos,0))),\"\"),\"\")","v":""},null,{"$f":"IF(ISNUMBER(J15),IFERROR(INDIRECT(CONCATENATE(Evento,1+MATCH(J15,Eventos,0))),\"\"),\"\")","v":""},null,{"$f":"IF(ISNUMBER(L15),IFERROR(INDIRECT(CONCATENATE(Evento,1+MATCH(L15,Eventos,0))),\"\"),\"\")","v":""},null,{"$f":"IF(ISNUMBER(N15),IFERROR(INDIRECT(CONCATENATE(Evento,1+MATCH(N15,Eventos,0))),\"\"),\"\")","v":"International Migrants Day"},null,{"$f":"IF(ISNUMBER(P15),IFERROR(INDIRECT(CONCATENATE(Evento,1+MATCH(P15,Eventos,0))),\"\"),\"\")","v":""}]
[null,{"$f":"IF(ISNUMBER(B15),IFERROR(INDIRECT(CONCATENATE(Agenda,1+MATCH(B15,Agendas,0))),\"\"),\"\")","v":""},null,{"$f":"IF(ISNUMBER(D15),IFERROR(INDIRECT(CONCATENATE(Agenda,1+MATCH(D15,Agendas,0))),\"\"),\"\")","v":""},null,{"$f":"IF(ISNUMBER(F15),IFERROR(INDIRECT(CONCATENATE(Agenda,1+MATCH(F15,Agendas,0))),\"\"),\"\")","v":""},null,{"$f":"IF(ISNUMBER(H15),IFERROR(INDIRECT(CONCATENATE(Agenda,1+MATCH(H15,Agendas,0))),\"\"),\"\")","v":""},null,{"$f":"IF(ISNUMBER(J15),IFERROR(INDIRECT(CONCATENATE(Agenda,1+MATCH(J15,Agendas,0))),\"\"),\"\")","v":""},null,{"$f":"IF(ISNUMBER(L15),IFERROR(INDIRECT(CONCATENATE(Agenda,1+MATCH(L15,Agendas,0))),\"\"),\"\")","v":""},null,{"$f":"IF(ISNUMBER(N15),IFERROR(INDIRECT(CONCATENATE(Agenda,1+MATCH(N15,Agendas,0))),\"\"),\"\")","v":""},null,{"$f":"IF(ISNUMBER(P15),IFERROR(INDIRECT(CONCATENATE(Agenda,1+MATCH(P15,Agendas,0))),\"\"),\"\")","v":""}]
[]
[]
[]
[{"$f":"WEEKNUM(B21,1)","v":52},{"$f":"P15","v":"2010-12-19"},{"$f":"IF(ISNUMBER(B21),IFERROR(INDIRECT(CONCATENATE(Fiesta,2+MATCH(B21,Fiestas,0))),\"\"),\"\")","v":""},{"$f":"P15+1","v":"2010-12-20"},{"$f":"IF(ISNUMBER(D21),IFERROR(INDIRECT(CONCATENATE(Fiesta,2+MATCH(D21,Fiestas,0))),\"\"),\"\")","v":""},{"$f":"D21+1","v":"2010-12-21"},{"$f":"IF(ISNUMBER(F21),IFERROR(INDIRECT(CONCATENATE(Fiesta,2+MATCH(F21,Fiestas,0))),\"\"),\"\")","v":""},{"$f":"F21+1","v":"2010-12-22"},{"$f":"IF(ISNUMBER(H21),IFERROR(INDIRECT(CONCATENATE(Fiesta,2+MATCH(H21,Fiestas,0))),\"\"),\"\")","v":""},{"$f":"H21+1","v":"2010-12-23"},{"$f":"IF(ISNUMBER(J21),IFERROR(INDIRECT(CONCATENATE(Fiesta,2+MATCH(J21,Fiestas,0))),\"\"),\"\")","v":""},{"$f":"J21+1","v":"2010-12-24"},{"$f":"IF(ISNUMBER(L21),IFERROR(INDIRECT(CONCATENATE(Fiesta,2+MATCH(L21,Fiestas,0))),\"\"),\"\")","v":"Christmas Day Holiday"},{"$f":"L21+1","v":"2010-12-25"},{"$f":"IF(ISNUMBER(N21),IFERROR(INDIRECT(CONCATENATE(Fiesta,2+MATCH(N21,Fiestas,0))),\"\"),\"\")","v":""},{"$f":"N21+1","v":"2010-12-26"},{"$f":"IF(ISNUMBER(P21),IFERROR(INDIRECT(CONCATENATE(Fiesta,2+MATCH(P21,Fiestas,0))),\"\"),\"\")","v":""},{"$f":"WEEKNUM(D21,2)","v":52}]
[null,{"$f":"IF(ISNUMBER(B21),IFERROR(INDIRECT(CONCATENATE(Evento,1+MATCH(B21,Eventos,0))),\"\"),\"\")","v":""},null,{"$f":"IF(ISNUMBER(D21),IFERROR(INDIRECT(CONCATENATE(Evento,1+MATCH(D21,Eventos,0))),\"\"),\"\")","v":""},null,{"$f":"IF(ISNUMBER(F21),IFERROR(INDIRECT(CONCATENATE(Evento,1+MATCH(F21,Eventos,0))),\"\"),\"\")","v":""},null,{"$f":"IF(ISNUMBER(H21),IFERROR(INDIRECT(CONCATENATE(Evento,1+MATCH(H21,Eventos,0))),\"\"),\"\")","v":""},null,{"$f":"IF(ISNUMBER(J21),IFERROR(INDIRECT(CONCATENATE(Evento,1+MATCH(J21,Eventos,0))),\"\"),\"\")","v":""},null,{"$f":"IF(ISNUMBER(L21),IFERROR(INDIRECT(CONCATENATE(Evento,1+MATCH(L21,Eventos,0))),\"\"),\"\")","v":""},null,{"$f":"IF(ISNUMBER(N21),IFERROR(INDIRECT(CONCATENATE(Evento,1+MATCH(N21,Eventos,0))),\"\"),\"\")","v":""},null,{"$f":"IF(ISNUMBER(P21),IFERROR(INDIRECT(CONCATENATE(Evento,1+MATCH(P21,Eventos,0))),\"\"),\"\")","v":""}]
[null,{"$f":"IF(ISNUMBER(B21),IFERROR(INDIRECT(CONCATENATE(Agenda,1+MATCH(B21,Agendas,0))),\"\"),\"\")","v":""},null,{"$f":"IF(ISNUMBER(D21),IFERROR(INDIRECT(CONCATENATE(Agenda,1+MATCH(D21,Agendas,0))),\"\"),\"\")","v":""},null,{"$f":"IF(ISNUMBER(F21),IFERROR(INDIRECT(CONCATENATE(Agenda,1+MATCH(F21,Agendas,0))),\"\"),\"\")","v":""},null,{"$f":"IF(ISNUMBER(H21),IFERROR(INDIRECT(CONCATENATE(Agenda,1+MATCH(H21,Agendas,0))),\"\"),\"\")","v":""},null,{"$f":"IF(ISNUMBER(J21),IFERROR(INDIRECT(CONCATENATE(Agenda,1+MATCH(J21,Agendas,0))),\"\"),\"\")","v":""},null,{"$f":"IF(ISNUMBER(L21),IFERROR(INDIRECT(CONCATENATE(Agenda,1+MATCH(L21,Agendas,0))),\"\"),\"\")","v":""},null,{"$f":"IF(ISNUMBER(N21),IFERROR(INDIRECT(CONCATENATE(Agenda,1+MATCH(N21,Agendas,0))),\"\"),\"\")","v":""},null,{"$f":"IF(ISNUMBER(P21),IFERROR(INDIRECT(CONCATENATE(Agenda,1+MATCH(P21,Agendas,0))),\"\"),\"\")","v":""}]
[]
[]
[]
[{"$f":"IF(B27=\"\",\"\",WEEKNUM(B27,1))","v":53},{"$f":"P21","v":"2010-12-26"},{"$f":"IF(ISNUMBER(B27),IFERROR(INDIRECT(CONCATENATE(Fiesta,2+MATCH(B27,Fiestas,0))),\"\"),\"\")","v":""},{"$f":"IF(P21<EOMONTH($D$1,0),P21+1,\"\")","v":"2010-12-27"},{"$f":"IF(ISNUMBER(D27),IFERROR(INDIRECT(CONCATENATE(Fiesta,2+MATCH(D27,Fiestas,0))),\"\"),\"\")","v":""},{"$f":"IF(D27<EOMONTH($D$1,0),D27+1,\"\")","v":"2010-12-28"},{"$f":"IF(ISNUMBER(F27),IFERROR(INDIRECT(CONCATENATE(Fiesta,2+MATCH(F27,Fiestas,0))),\"\"),\"\")","v":""},{"$f":"IF(F27<EOMONTH($D$1,0),F27+1,\"\")","v":"2010-12-29"},{"$f":"IF(ISNUMBER(H27),IFERROR(INDIRECT(CONCATENATE(Fiesta,2+MATCH(H27,Fiestas,0))),\"\"),\"\")","v":""},{"$f":"IF(H27<EOMONTH($D$1,0),H27+1,\"\")","v":"2010-12-30"},{"$f":"IF(ISNUMBER(J27),IFERROR(INDIRECT(CONCATENATE(Fiesta,2+MATCH(J27,Fiestas,0))),\"\"),\"\")","v":""},{"$f":"IF(J27<EOMONTH($D$1,0),J27+1,\"\")","v":"2010-12-31"},{"$f":"IF(ISNUMBER(L27),IFERROR(INDIRECT(CONCATENATE(Fiesta,2+MATCH(L27,Fiestas,0))),\"\"),\"\")","v":""},{"$f":"IF(L27<EOMONTH($D$1,0),L27+1,\"\")","v":""},{"$f":"IF(ISNUMBER(N27),IFERROR(INDIRECT(CONCATENATE(Fiesta,2+MATCH(N27,Fiestas,0))),\"\"),\"\")","v":""},{"$f":"IF(N27<EOMONTH($D$1,0),N27+1,\"\")","v":""},{"$f":"IF(ISNUMBER(P27),IFERROR(INDIRECT(CONCATENATE(Fiesta,2+MATCH(P27,Fiestas,0))),\"\"),\"\")","v":""},{"$f":"IF(D27=\"\",\"\",WEEKNUM(D27,2))","v":53}]
[null,{"$f":"IF(ISNUMBER(B27),IFERROR(INDIRECT(CONCATENATE(Evento,1+MATCH(B27,Eventos,0))),\"\"),\"\")","v":""},null,{"$f":"IF(ISNUMBER(D27),IFERROR(INDIRECT(CONCATENATE(Evento,1+MATCH(D27,Eventos,0))),\"\"),\"\")","v":""},null,{"$f":"IF(ISNUMBER(F27),IFERROR(INDIRECT(CONCATENATE(Evento,1+MATCH(F27,Eventos,0))),\"\"),\"\")","v":""},null,{"$f":"IF(ISNUMBER(H27),IFERROR(INDIRECT(CONCATENATE(Evento,1+MATCH(H27,Eventos,0))),\"\"),\"\")","v":""},null,{"$f":"IF(ISNUMBER(J27),IFERROR(INDIRECT(CONCATENATE(Evento,1+MATCH(J27,Eventos,0))),\"\"),\"\")","v":""},null,{"$f":"IF(ISNUMBER(L27),IFERROR(INDIRECT(CONCATENATE(Evento,1+MATCH(L27,Eventos,0))),\"\"),\"\")","v":""},null,{"$f":"IF(ISNUMBER(N27),IFERROR(INDIRECT(CONCATENATE(Evento,1+MATCH(N27,Eventos,0))),\"\"),\"\")","v":""},null,{"$f":"IF(ISNUMBER(P27),IFERROR(INDIRECT(CONCATENATE(Evento,1+MATCH(P27,Eventos,0))),\"\"),\"\")","v":""}]
[null,{"$f":"IF(ISNUMBER(B27),IFERROR(INDIRECT(CONCATENATE(Agenda,1+MATCH(B27,Agendas,0))),\"\"),\"\")","v":""},null,{"$f":"IF(ISNUMBER(D27),IFERROR(INDIRECT(CONCATENATE(Agenda,1+MATCH(D27,Agendas,0))),\"\"),\"\")","v":""},null,{"$f":"IF(ISNUMBER(F27),IFERROR(INDIRECT(CONCATENATE(Agenda,1+MATCH(F27,Agendas,0))),\"\"),\"\")","v":""},null,{"$f":"IF(ISNUMBER(H27),IFERROR(INDIRECT(CONCATENATE(Agenda,1+MATCH(H27,Agendas,0))),\"\"),\"\")","v":""},null,{"$f":"IF(ISNUMBER(J27),IFERROR(INDIRECT(CONCATENATE(Agenda,1+MATCH(J27,Agendas,0))),\"\"),\"\")","v":""},null,{"$f":"IF(ISNUMBER(L27),IFERROR(INDIRECT(CONCATENATE(Agenda,1+MATCH(L27,Agendas,0))),\"\"),\"\")","v":""},null,{"$f":"IF(ISNUMBER(N27),IFERROR(INDIRECT(CONCATENATE(Agenda,1+MATCH(N27,Agendas,0))),\"\"),\"\")","v":""},null,{"$f":"IF(ISNUMBER(P27),IFERROR(INDIRECT(CONCATENATE(Agenda,1+MATCH(P27,Agendas,0))),\"\"),\"\")","v":""}]
[]
[]
[]
[{"$f":"IF(B33=\"\",\"\",WEEKNUM(B33,1))","v":""},{"$f":"P27","v":""},{"$f":"IF(ISNUMBER(B33),IFERROR(INDIRECT(CONCATENATE(Fiesta,2+MATCH(B33,Fiestas,0))),\"\"),\"\")","v":""},{"$f":"IF(P27<EOMONTH($D$1,0),P27+1,\"\")","v":""},{"$f":"IF(ISNUMBER(D33),IFERROR(INDIRECT(CONCATENATE(Fiesta,2+MATCH(D33,Fiestas,0))),\"\"),\"\")","v":""},{"$f":"IF(D33<EOMONTH($D$1,0),D33+1,\"\")","v":""},{"$f":"IF(ISNUMBER(F33),IFERROR(INDIRECT(CONCATENATE(Fiesta,2+MATCH(F33,Fiestas,0))),\"\"),\"\")","v":""},"Notes:",null,null,null,null,null,null,null,null,null,{"$f":"IF(D33=\"\",\"\",WEEKNUM(D33,2))","v":""}]
[null,{"$f":"IF(ISNUMBER(B33),IFERROR(INDIRECT(CONCATENATE(Evento,1+MATCH(B33,Eventos,0))),\"\"),\"\")","v":""},null,{"$f":"IF(ISNUMBER(D33),IFERROR(INDIRECT(CONCATENATE(Evento,1+MATCH(D33,Eventos,0))),\"\"),\"\")","v":""},null,{"$f":"IF(ISNUMBER(F33),IFERROR(INDIRECT(CONCATENATE(Evento,1+MATCH(F33,Eventos,0))),\"\"),\"\")","v":""}]
[null,{"$f":"IF(ISNUMBER(B33),IFERROR(INDIRECT(CONCATENATE(Agenda,1+MATCH(B33,Agendas,0))),\"\"),\"\")","v":""},null,{"$f":"IF(ISNUMBER(D33),IFERROR(INDIRECT(CONCATENATE(Agenda,1+MATCH(D33,Agendas,0))),\"\"),\"\")","v":""},null,{"$f":"IF(ISNUMBER(F33),IFERROR(INDIRECT(CONCATENATE(Agenda,1+MATCH(F33,Agendas,0))),\"\"),\"\")","v":""}]

{"sheet":"Mini","index":16,"n_rows":15,"n_cols":39,"rows_kept":15,"cut":false,"hidden":false,"merged":[[16,1,16,6]]}
[]
[null,null,2,3,4,5,6,7,1,2,3,4,5,6,7,1,2,3,4,5,6,7,1,2,3,4,5,6,7,1,2,3,4,5,6,7,1,2,3]
[null,{"$f":"Cal!M3","v":2010},{"$f":"DATE(2010,2,1)","v":"2010-02-01"},{"$f":"C3+1","v":"2010-02-02"},"2010-02-03","2010-02-04","2010-02-05","2010-02-06","2010-02-07","2010-02-08","2010-02-09","2010-02-10","2010-02-11","2010-02-12","2010-02-13","2010-02-14","2010-02-15","2010-02-16","2010-02-17","2010-02-18","2010-02-19","2010-02-20","2010-02-21","2010-02-22","2010-02-23","2010-02-24","2010-02-25","2010-02-26","2010-02-27","2010-02-28","2010-03-01","2010-03-02","2010-03-03","2010-03-04","2010-03-05","2010-03-06","2010-03-07","2010-03-08","2010-03-09"]
[null,{"$f":"DATE($B$3,1,1)","v":"2010-01-01"},{"$f":"IF(WEEKDAY($B4)=2,$B4,\"\")","v":""},{"$f":"IF(C4<>\"\",C4+1,IF(WEEKDAY($B4)=3,$B4,\"\"))","v":""},{"$f":"IF(D4<>\"\",D4+1,IF(WEEKDAY($B4)=4,$B4,\"\"))","v":""},{"$f":"IF(E4<>\"\",E4+1,IF(WEEKDAY($B4)=5,$B4,\"\"))","v":""},{"$f":"IF(F4<>\"\",F4+1,IF(WEEKDAY($B4)=6,$B4,\"\"))","v":"2010-01-01"},{"$f":"IF(G4<>\"\",G4+1,IF(WEEKDAY($B4)=7,$B4,\"\"))","v":"2010-01-02"},{"$f":"IF(H4<>\"\",H4+1,IF(WEEKDAY($B4)=1,$B4,\"\"))","v":"2010-01-03"},{"$f":"I4+1","v":"2010-01-04"},{"$f":"J4+1","v":"2010-01-05"},"2010-01-06","2010-01-07","2010-01-08","2010-01-09","2010-01-10","2010-01-11","2010-01-12","2010-01-13","2010-01-14","2010-01-15","2010-01-16","2010-01-17","2010-01-18","2010-01-19","2010-01-20","2010-01-21","2010-01-22","2010-01-23","2010-01-24",{"$f":"IF(AD4<EOMONTH($B4,0),AD4+1,\"\")","v":"2010-01-25"},{"$f":"IF(AE4<EOMONTH($B4,0),AE4+1,\"\")","v":"2010-01-26"},"2010-01-27","2010-01-28","2010-01-29","2010-01-30","2010-01-31","",""]
[null,{"$f":"DATE($B$3,2,1)","v":"2010-02-01"},{"$f":"IF(WEEKDAY($B5)=2,$B5,\"\")","v":"2010-02-01"},{"$f":"IF(C5<>\"\",C5+1,IF(WEEKDAY($B5)=3,$B5,\"\"))","v":"2010-02-02"},{"$f":"IF(D5<>\"\",D5+1,IF(WEEKDAY($B5)=4,$B5,\"\"))","v":"2010-02-03"},{"$f":"IF(E5<>\"\",E5+1,IF(WEEKDAY($B5)=5,$B5,\"\"))","v":"2010-02-04"},{"$f":"IF(F5<>\"\",F5+1,IF(WEEKDAY($B5)=6,$B5,\"\"))","v":"2010-02-05"},{"$f":"IF(G5<>\"\",G5+1,IF(WEEKDAY($B5)=7,$B5,\"\"))","v":"2010-02-06"},{"$f":"IF(H5<>\"\",H5+1,IF(WEEKDAY($B5)=1,$B5,\"\"))","v":"2010-02-07"},{"$f":"I5+1","v":"2010-02-08"},"2010-02-09","2010-02-10","2010-02-11","2010-02-12","2010-02-13","2010-02-14","2010-02-15","2010-02-16","2010-02-17","2010-02-18","2010-02-19","2010-02-20","2010-02-21","2010-02-22","2010-02-23","2010-02-24","2010-02-25","2010-02-26","2010-02-27","2010-02-28",{"$f":"IF(AD5<EOMONTH($B5,0),AD5+1,\"\")","v":""},{"$f":"IF(AE5<EOMONTH($B5,0),AE5+1,\"\")","v":""},"","","","","","",""]
[null,{"$f":"DATE($B$3,3,1)","v":"2010-03-01"},"2010-03-01","2010-03-02","2010-03-03","2010-03-04","2010-03-05","2010-03-06","2010-03-07",{"$f":"I6+1","v":"2010-03-08"},"2010-03-09","2010-03-10","2010-03-11","2010-03-12","2010-03-13","2010-03-14","2010-03-15","2010-03-16","2010-03-17","2010-03-18","2010-03-19","2010-03-20","2010-03-21","2010-03-22","2010-03-23","2010-03-24","2010-03-25","2010-03-26","2010-03-27","2010-03-28","2010-03-29",{"$f":"IF(AE6<EOMONTH($B6,0),AE6+1,\"\")","v":"2010-03-30"},"2010-03-31","","","","","",""]
[null,{"$f":"DATE($B$3,4,1)","v":"2010-04-01"},"","","","2010-04-01","2010-04-02","2010-04-03","2010-04-04",{"$f":"I7+1","v":"2010-04-05"},"2010-04-06","2010-04-07","2010-04-08","2010-04-09","2010-04-10","2010-04-11","2010-04-12","2010-04-13","2010-04-14","2010-04-15","2010-04-16","2010-04-17","2010-04-18","2010-04-19","2010-04-20","2010-04-21","2010-04-22","2010-04-23","2010-04-24","2010-04-25","2010-04-26",{"$f":"IF(AE7<EOMONTH($B7,0),AE7+1,\"\")","v":"2010-04-27"},"2010-04-28","2010-04-29","2010-04-30","","","",""]
[null,{"$f":"DATE($B$3,5,1)","v":"2010-05-01"},"","","","","","2010-05-01","2010-05-02",{"$f":"I8+1","v":"2010-05-03"},"2010-05-04","2010-05-05","2010-05-06","2010-05-07","2010-05-08","2010-05-09","2010-05-10","2010-05-11","2010-05-12","2010-05-13","2010-05-14","2010-05-15","2010-05-16","2010-05-17","2010-05-18","2010-05-19","2010-05-20","2010-05-21","2010-05-22","2010-05-23","2010-05-24",{"$f":"IF(AE8<EOMONTH($B8,0),AE8+1,\"\")","v":"2010-05-25"},"2010-05-26","2010-05-27","2010-05-28","2010-05-29","2010-05-30","2010-05-31",""]
[null,{"$f":"DATE($B$3,6,1)","v":"2010-06-01"},"","2010-06-01","2010-06-02","2010-06-03","2010-06-04","2010-06-05","2010-06-06",{"$f":"I9+1","v":"2010-06-07"},"2010-06-08","2010-06-09","2010-06-10","2010-06-11","2010-06-12","2010-06-13","2010-06-14","2010-06-15","2010-06-16","2010-06-17","2010-06-18","2010-06-19","2010-06-20","2010-06-21","2010-06-22","2010-06-23","2010-06-24","2010-06-25","2010-06-26","2010-06-27","2010-06-28",{"$f":"IF(AE9<EOMONTH($B9,0),AE9+1,\"\")","v":"2010-06-29"},"2010-06-30","","","","","",""]
[null,{"$f":"DATE($B$3,7,1)","v":"2010-07-01"},"","","","2010-07-01","2010-07-02","2010-07-03","2010-07-04",{"$f":"I10+1","v":"2010-07-05"},"2010-07-06","2010-07-07","2010-07-08","2010-07-09","2010-07-10","2010-07-11","2010-07-12","2010-07-13","2010-07-14","2010-07-15","2010-07-16","2010-07-17","2010-07-18","2010-07-19","2010-07-20","2010-07-21","2010-07-22","2010-07-23","2010-07-24","2010-07-25","2010-07-26",{"$f":"IF(AE10<EOMONTH($B10,0),AE10+1,\"\")","v":"2010-07-27"},"2010-07-28","2010-07-29","2010-07-30","2010-07-31","","",""]
[null,{"$f":"DATE($B$3,8,1)","v":"2010-08-01"},"","","","","","","2010-08-01",{"$f":"I11+1","v":"2010-08-02"},"2010-08-03","2010-08-04","2010-08-05","2010-08-06","2010-08-07","2010-08-08","2010-08-09","2010-08-10","2010-08-11","2010-08-12","2010-08-13","2010-08-14","2010-08-15","2010-08-16","2010-08-17","2010-08-18","2010-08-19","2010-08-20","2010-08-21","2010-08-22","2010-08-23",{"$f":"IF(AE11<EOMONTH($B11,0),AE11+1,\"\")","v":"2010-08-24"},"2010-08-25","2010-08-26","2010-08-27","2010-08-28","2010-08-29","2010-08-30","2010-08-31"]
[null,{"$f":"DATE($B$3,9,1)","v":"2010-09-01"},"","","2010-09-01","2010-09-02","2010-09-03","2010-09-04","2010-09-05",{"$f":"I12+1","v":"2010-09-06"},"2010-09-07","2010-09-08","2010-09-09","2010-09-10","2010-09-11","2010-09-12","2010-09-13","2010-09-14","2010-09-15","2010-09-16","2010-09-17","2010-09-18","2010-09-19","2010-09-20","2010-09-21","2010-09-22","2010-09-23","2010-09-24","2010-09-25","2010-09-26","2010-09-27",{"$f":"IF(AE12<EOMONTH($B12,0),AE12+1,\"\")","v":"2010-09-28"},"2010-09-29","2010-09-30","","","","",""]
[null,{"$f":"DATE($B$3,10,1)","v":"2010-10-01"},"","","","","2010-10-01","2010-10-02","2010-10-03",{"$f":"I13+1","v":"2010-10-04"},"2010-10-05","2010-10-06","2010-10-07","2010-10-08","2010-10-09","2010-10-10","2010-10-11","2010-10-12","2010-10-13","2010-10-14","2010-10-15","2010-10-16","2010-10-17","2010-10-18","2010-10-19","2010-10-20","2010-10-21","2010-10-22","2010-10-23","2010-10-24","2010-10-25",{"$f":"IF(AE13<EOMONTH($B13,0),AE13+1,\"\")","v":"2010-10-26"},"2010-10-27","2010-10-28","2010-10-29","2010-10-30","2010-10-31","",""]
[null,{"$f":"DATE($B$3,11,1)","v":"2010-11-01"},"2010-11-01","2010-11-02","2010-11-03","2010-11-04","2010-11-05","2010-11-06","2010-11-07",{"$f":"I14+1","v":"2010-11-08"},"2010-11-09","2010-11-10","2010-11-11","2010-11-12","2010-11-13","2010-11-14","2010-11-15","2010-11-16","2010-11-17","2010-11-18","2010-11-19","2010-11-20","2010-11-21","2010-11-22","2010-11-23","2010-11-24","2010-11-25","2010-11-26","2010-11-27","2010-11-28","2010-11-29",{"$f":"IF(AE14<EOMONTH($B14,0),AE14+1,\"\")","v":"2010-11-30"},"","","","","","",""]
[null,{"$f":"DATE($B$3,12,1)","v":"2010-12-01"},"","","2010-12-01","2010-12-02","2010-12-03","2010-12-04","2010-12-05",{"$f":"I15+1","v":"2010-12-06"},"2010-12-07","2010-12-08","2010-12-09","2010-12-10","2010-12-11","2010-12-12","2010-12-13","2010-12-14","2010-12-15","2010-12-16","2010-12-17","2010-12-18","2010-12-19","2010-12-20","2010-12-21","2010-12-22","2010-12-23","2010-12-24","2010-12-25","2010-12-26","2010-12-27",{"$f":"IF(AE15<EOMONTH($B15,0),AE15+1,\"\")","v":"2010-12-28"},"2010-12-29","2010-12-30","2010-12-31","","","",""]

{"sheet":"Años","index":17,"n_rows":8100,"n_cols":1,"rows_kept":8100,"cut":false,"hidden":true,"merged":[]}
[1900]
[1901]
[1902]
[1903]
[1904]
[1905]
[1906]
[1907]
[1908]
[1909]
[1910]
[1911]
[1912]
[1913]
[1914]
[1915]
[1916]
[1917]
[1918]
[1919]
[1920]
[1921]
[1922]
[1923]
[1924]
[1925]
[1926]
[1927]
[1928]
[1929]
[1930]
[1931]
[1932]
[1933]
[1934]
[1935]
[1936]
[1937]
[1938]
[1939]
[1940]
[1941]
[1942]
[1943]
[1944]
[1945]
[1946]
[1947]
[1948]
[1949]
[1950]
[1951]
[1952]
[1953]
[1954]
[1955]
[1956]
[1957]
[1958]
[1959]
[1960]
[1961]
[1962]
[1963]
[1964]
[1965]
[1966]
[1967]
[1968]
[1969]
[1970]
[1971]
[1972]
[1973]
[1974]
[1975]
[1976]
[1977]
[1978]
[1979]
[1980]
[1981]
[1982]
[1983]
[1984]
[1985]
[1986]
[1987]
[1988]
[1989]
[1990]
[1991]
[1992]
[1993]
[1994]
[1995]
[1996]
[1997]
[1998]
[1999]
[2000]
[2001]
[2002]
[2003]
[2004]
[2005]
[2006]
[2007]
[2008]
[2009]
[2010]
[2011]
[2012]
[2013]
[2014]
[2015]
[2016]
[2017]
[2018]
[2019]
[2020]
[2021]
[2022]
[2023]
[2024]
[2025]
[2026]
[2027]
[2028]
[2029]
[2030]
[2031]
[2032]
[2033]
[2034]
[2035]
[2036]
[2037]
[2038]
[2039]
[2040]
[2041]
[2042]
[2043]
[2044]
[2045]
[2046]
[2047]
[2048]
[2049]
[2050]
[2051]
[2052]
[2053]
[2054]
[2055]
[2056]
[2057]
[2058]
[2059]
[2060]
[2061]
[2062]
[2063]
[2064]
[2065]
[2066]
[2067]
[2068]
[2069]
[2070]
[2071]
[2072]
[2073]
[2074]
[2075]
[2076]
[2077]
[2078]
[2079]
[2080]
[2081]
[2082]
[2083]
[2084]
[2085]
[2086]
[2087]
[2088]
[2089]
[2090]
[2091]
[2092]
[2093]
[2094]
[2095]
[2096]
[2097]
[2098]
[2099]
[2100]
[2101]
[2102]
[2103]
[2104]
[2105]
[2106]
[2107]
[2108]
[2109]
[2110]
[2111]
[2112]
[2113]
[2114]
[2115]
[2116]
[2117]
[2118]
[2119]
[2120]
[2121]
[2122]
[2123]
[2124]
[2125]
[2126]
[2127]
[2128]
[2129]
[2130]
[2131]
[2132]
[2133]
[2134]
[2135]
[2136]
[2137]
[2138]
[2139]
[2140]
[2141]
[2142]
[2143]
[2144]
[2145]
[2146]
[2147]
[2148]
[2149]
[2150]
[2151]
[2152]
[2153]
[2154]
[2155]
[2156]
[2157]
[2158]
[2159]
[2160]
[2161]
[2162]
[2163]
[2164]
[2165]
[2166]
[2167]
[2168]
[2169]
[2170]
[2171]
[2172]
[2173]
[2174]
[2175]
[2176]
[2177]
[2178]
[2179]
[2180]
[2181]
[2182]
[2183]
[2184]
[2185]
[2186]
[2187]
[2188]
[2189]
[2190]
[2191]
[2192]
[2193]
[2194]
[2195]
[2196]
[2197]
[2198]
[2199]
[2200]
[2201]
[2202]
[2203]
[2204]
[2205]
[2206]
[2207]
[2208]
[2209]
[2210]
[2211]
[2212]
[2213]
[2214]
[2215]
[2216]
[2217]
[2218]
[2219]
[2220]
[2221]
[2222]
[2223]
[2224]
[2225]
[2226]
[2227]
[2228]
[2229]
[2230]
[2231]
[2232]
[2233]
[2234]
[2235]
[2236]
[2237]
[2238]
[2239]
[2240]
[2241]
[2242]
[2243]
[2244]
[2245]
[2246]
[2247]
[2248]
[2249]
[2250]
[2251]
[2252]
[2253]
[2254]
[2255]
[2256]
[2257]
[2258]
[2259]
[2260]
[2261]
[2262]
[2263]
[2264]
[2265]
[2266]
[2267]
[2268]
[2269]
[2270]
[2271]
[2272]
[2273]
[2274]
[2275]
[2276]
[2277]
[2278]
[2279]
[2280]
[2281]
[2282]
[2283]
[2284]
[2285]
[2286]
[2287]
[2288]
[2289]
[2290]
[2291]
[2292]
[2293]
[2294]
[2295]
[2296]
[2297]
[2298]
[2299]
[2300]
[2301]
[2302]
[2303]
[2304]
[2305]
[2306]
[2307]
[2308]
[2309]
[2310]
[2311]
[2312]
[2313]
[2314]
[2315]
[2316]
[2317]
[2318]
[2319]
[2320]
[2321]
[2322]
[2323]
[2324]
[2325]
[2326]
[2327]
[2328]
[2329]
[2330]
[2331]
[2332]
[2333]
[2334]
[2335]
[2336]
[2337]
[2338]
[2339]
[2340]
[2341]
[2342]
[2343]
[2344]
[2345]
[2346]
[2347]
[2348]
[2349]
[2350]
[2351]
[2352]
[2353]
[2354]
[2355]
[2356]
[2357]
[2358]
[2359]
[2360]
[2361]
[2362]
[2363]
[2364]
[2365]
[2366]
[2367]
[2368]
[2369]
[2370]
[2371]
[2372]
[2373]
[2374]
[2375]
[2376]
[2377]
[2378]
[2379]
[2380]
[2381]
[2382]
[2383]
[2384]
[2385]
[2386]
[2387]
[2388]
[2389]
[2390]
[2391]
[2392]
[2393]
[2394]
[2395]
[2396]
[2397]
[2398]
[2399]
[2400]
[2401]
[2402]
[2403]
[2404]
[2405]
[2406]
[2407]
[2408]
[2409]
[2410]
[2411]
[2412]
[2413]
[2414]
[2415]
[2416]
[2417]
[2418]
[2419]
[2420]
[2421]
[2422]
[2423]
[2424]
[2425]
[2426]
[2427]
[2428]
[2429]
[2430]
[2431]
[2432]
[2433]
[2434]
[2435]
[2436]
[2437]
[2438]
[2439]
[2440]
[2441]
[2442]
[2443]
[2444]
[2445]
[2446]
[2447]
[2448]
[2449]
[2450]
[2451]
[2452]
[2453]
[2454]
[2455]
[2456]
[2457]
[2458]
[2459]
[2460]
[2461]
[2462]
[2463]
[2464]
[2465]
[2466]
[2467]
[2468]
[2469]
[2470]
[2471]
[2472]
[2473]
[2474]
[2475]
[2476]
[2477]
[2478]
[2479]
[2480]
[2481]
[2482]
[2483]
[2484]
[2485]
[2486]
[2487]
[2488]
[2489]
[2490]
[2491]
[2492]
[2493]
[2494]
[2495]
[2496]
[2497]
[2498]
[2499]
[2500]
[2501]
[2502]
[2503]
[2504]
[2505]
[2506]
[2507]
[2508]
[2509]
[2510]
[2511]
[2512]
[2513]
[2514]
[2515]
[2516]
[2517]
[2518]
[2519]
[2520]
[2521]
[2522]
[2523]
[2524]
[2525]
[2526]
[2527]
[2528]
[2529]
[2530]
[2531]
[2532]
[2533]
[2534]
[2535]
[2536]
[2537]
[2538]
[2539]
[2540]
[2541]
[2542]
[2543]
[2544]
[2545]
[2546]
[2547]
[2548]
[2549]
[2550]
[2551]
[2552]
[2553]
[2554]
[2555]
[2556]
[2557]
[2558]
[2559]
[2560]
[2561]
[2562]
[2563]
[2564]
[2565]
[2566]
[2567]
[2568]
[2569]
[2570]
[2571]
[2572]
[2573]
[2574]
[2575]
[2576]
[2577]
[2578]
[2579]
[2580]
[2581]
[2582]
[2583]
[2584]
[2585]
[2586]
[2587]
[2588]
[2589]
[2590]
[2591]
[2592]
[2593]
[2594]
[2595]
[2596]
[2597]
[2598]
[2599]
[2600]
[2601]
[2602]
[2603]
[2604]
[2605]
[2606]
[2607]
[2608]
[2609]
[2610]
[2611]
[2612]
[2613]
[2614]
[2615]
[2616]
[2617]
[2618]
[2619]
[2620]
[2621]
[2622]
[2623]
[2624]
[2625]
[2626]
[2627]
[2628]
[2629]
[2630]
[2631]
[2632]
[2633]
[2634]
[2635]
[2636]
[2637]
[2638]
[2639]
[2640]
[2641]
[2642]
[2643]
[2644]
[2645]
[2646]
[2647]
[2648]
[2649]
[2650]
[2651]
[2652]
[2653]
[2654]
[2655]
[2656]
[2657]
[2658]
[2659]
[2660]
[2661]
[2662]
[2663]
[2664]
[2665]
[2666]
[2667]
[2668]
[2669]
[2670]
[2671]
[2672]
[2673]
[2674]
[2675]
[2676]
[2677]
[2678]
[2679]
[2680]
[2681]
[2682]
[2683]
[2684]
[2685]
[2686]
[2687]
[2688]
[2689]
[2690]
[2691]
[2692]
[2693]
[2694]
[2695]
[2696]
[2697]
[2698]
[2699]
[2700]
[2701]
[2702]
[2703]
[2704]
[2705]
[2706]
[2707]
[2708]
[2709]
[2710]
[2711]
[2712]
[2713]
[2714]
[2715]
[2716]
[2717]
[2718]
[2719]
[2720]
[2721]
[2722]
[2723]
[2724]
[2725]
[2726]
[2727]
[2728]
[2729]
[2730]
[2731]
[2732]
[2733]
[2734]
[2735]
[2736]
[2737]
[2738]
[2739]
[2740]
[2741]
[2742]
[2743]
[2744]
[2745]
[2746]
[2747]
[2748]
[2749]
[2750]
[2751]
[2752]
[2753]
[2754]
[2755]
[2756]
[2757]
[2758]
[2759]
[2760]
[2761]
[2762]
[2763]
[2764]
[2765]
[2766]
[2767]
[2768]
[2769]
[2770]
[2771]
[2772]
[2773]
[2774]
[2775]
[2776]
[2777]
[2778]
[2779]
[2780]
[2781]
[2782]
[2783]
[2784]
[2785]
[2786]
[2787]
[2788]
[2789]
[2790]
[2791]
[2792]
[2793]
[2794]
[2795]
[2796]
[2797]
[2798]
[2799]
[2800]
[2801]
[2802]
[2803]
[2804]
[2805]
[2806]
[2807]
[2808]
[2809]
[2810]
[2811]
[2812]
[2813]
[2814]
[2815]
[2816]
[2817]
[2818]
[2819]
[2820]
[2821]
[2822]
[2823]
[2824]
[2825]
[2826]
[2827]
[2828]
[2829]
[2830]
[2831]
[2832]
[2833]
[2834]
[2835]
[2836]
[2837]
[2838]
[2839]
[2840]
[2841]
[2842]
[2843]
[2844]
[2845]
[2846]
[2847]
[2848]
[2849]
[2850]
[2851]
[2852]
[2853]
[2854]
[2855]
[2856]
[2857]
[2858]
[2859]
[2860]
[2861]
[2862]
[2863]
[2864]
[2865]
[2866]
[2867]
[2868]
[2869]
[2870]
[2871]
[2872]
[2873]
[2874]
[2875]
[2876]
[2877]
[2878]
[2879]
[2880]
[2881]
[2882]
[2883]
[2884]
[2885]
[2886]
[2887]
[2888]
[2889]
[2890]
[2891]
[2892]
[2893]
[2894]
[2895]
[2896]
[2897]
[2898]
[2899]
[2900]
[2901]
[2902]
[2903]
[2904]
[2905]
[2906]
[2907]
[2908]
[2909]
[2910]
[2911]
[2912]
[2913]
[2914]
[2915]
[2916]
[2917]
[2918]
[2919]
[2920]
[2921]
[2922]
[2923]
[2924]
[2925]
[2926]
[2927]
[2928]
[2929]
[2930]
[2931]
[2932]
[2933]
[2934]
[2935]
[2936]
[2937]
[2938]
[2939]
[2940]
[2941]
[2942]
[2943]
[2944]
[2945]
[2946]
[2947]
[2948]
[2949]
[2950]
[2951]
[2952]
[2953]
[2954]
[2955]
[2956]
[2957]
[2958]
[2959]
[2960]
[2961]
[2962]
[2963]
[2964]
[2965]
[2966]
[2967]
[2968]
[2969]
[2970]
[2971]
[2972]
[2973]
[2974]
[2975]
[2976]
[2977]
[2978]
[2979]
[2980]
[2981]
[2982]
[2983]
[2984]
[2985]
[2986]
[2987]
[2988]
[2989]
[2990]
[2991]
[2992]
[2993]
[2994]
[2995]
[2996]
[2997]
[2998]
[2999]
[3000]
[3001]
[3002]
[3003]
[3004]
[3005]
[3006]
[3007]
[3008]
[3009]
[3010]
[3011]
[3012]
[3013]
[3014]
[3015]
[3016]
[3017]
[3018]
[3019]
[3020]
[3021]
[3022]
[3023]
[3024]
[3025]
[3026]
[3027]
[3028]
[3029]
[3030]
[3031]
[3032]
[3033]
[3034]
[3035]
[3036]
[3037]
[3038]
[3039]
[3040]
[3041]
[3042]
[3043]
[3044]
[3045]
[3046]
[3047]
[3048]
[3049]
[3050]
[3051]
[3052]
[3053]
[3054]
[3055]
[3056]
[3057]
[3058]
[3059]
[3060]
[3061]
[3062]
[3063]
[3064]
[3065]
[3066]
[3067]
[3068]
[3069]
[3070]
[3071]
[3072]
[3073]
[3074]
[3075]
[3076]
[3077]
[3078]
[3079]
[3080]
[3081]
[3082]
[3083]
[3084]
[3085]
[3086]
[3087]
[3088]
[3089]
[3090]
[3091]
[3092]
[3093]
[3094]
[3095]
[3096]
[3097]
[3098]
[3099]
[3100]
[3101]
[3102]
[3103]
[3104]
[3105]
[3106]
[3107]
[3108]
[3109]
[3110]
[3111]
[3112]
[3113]
[3114]
[3115]
[3116]
[3117]
[3118]
[3119]
[3120]
[3121]
[3122]
[3123]
[3124]
[3125]
[3126]
[3127]
[3128]
[3129]
[3130]
[3131]
[3132]
[3133]
[3134]
[3135]
[3136]
[3137]
[3138]
[3139]
[3140]
[3141]
[3142]
[3143]
[3144]
[3145]
[3146]
[3147]
[3148]
[3149]
[3150]
[3151]
[3152]
[3153]
[3154]
[3155]
[3156]
[3157]
[3158]
[3159]
[3160]
[3161]
[3162]
[3163]
[3164]
[3165]
[3166]
[3167]
[3168]
[3169]
[3170]
[3171]
[3172]
[3173]
[3174]
[3175]
[3176]
[3177]
[3178]
[3179]
[3180]
[3181]
[3182]
[3183]
[3184]
[3185]
[3186]
[3187]
[3188]
[3189]
[3190]
[3191]
[3192]
[3193]
[3194]
[3195]
[3196]
[3197]
[3198]
[3199]
[3200]
[3201]
[3202]
[3203]
[3204]
[3205]
[3206]
[3207]
[3208]
[3209]
[3210]
[3211]
[3212]
[3213]
[3214]
[3215]
[3216]
[3217]
[3218]
[3219]
[3220]
[3221]
[3222]
[3223]
[3224]
[3225]
[3226]
[3227]
[3228]
[3229]
[3230]
[3231]
[3232]
[3233]
[3234]
[3235]
[3236]
[3237]
[3238]
[3239]
[3240]
[3241]
[3242]
[3243]
[3244]
[3245]
[3246]
[3247]
[3248]
[3249]
[3250]
[3251]
[3252]
[3253]
[3254]
[3255]
[3256]
[3257]
[3258]
[3259]
[3260]
[3261]
[3262]
[3263]
[3264]
[3265]
[3266]
[3267]
[3268]
[3269]
[3270]
[3271]
[3272]
[3273]
[3274]
[3275]
[3276]
[3277]
[3278]
[3279]
[3280]
[3281]
[3282]
[3283]
[3284]
[3285]
[3286]
[3287]
[3288]
[3289]
[3290]
[3291]
[3292]
[3293]
[3294]
[3295]
[3296]
[3297]
[3298]
[3299]
[3300]
[3301]
[3302]
[3303]
[3304]
[3305]
[3306]
[3307]
[3308]
[3309]
[3310]
[3311]
[3312]
[3313]
[3314]
[3315]
[3316]
[3317]
[3318]
[3319]
[3320]
[3321]
[3322]
[3323]
[3324]
[3325]
[3326]
[3327]
[3328]
[3329]
[3330]
[3331]
[3332]
[3333]
[3334]
[3335]
[3336]
[3337]
[3338]
[3339]
[3340]
[3341]
[3342]
[3343]
[3344]
[3345]
[3346]
[3347]
[3348]
[3349]
[3350]
[3351]
[3352]
[3353]
[3354]
[3355]
[3356]
[3357]
[3358]
[3359]
[3360]
[3361]
[3362]
[3363]
[3364]
[3365]
[3366]
[3367]
[3368]
[3369]
[3370]
[3371]
[3372]
[3373]
[3374]
[3375]
[3376]
[3377]
[3378]
[3379]
[3380]
[3381]
[3382]
[3383]
[3384]
[3385]
[3386]
[3387]
[3388]
[3389]
[3390]
[3391]
[3392]
[3393]
[3394]
[3395]
[3396]
[3397]
[3398]
[3399]
[3400]
[3401]
[3402]
[3403]
[3404]
[3405]
[3406]
[3407]
[3408]
[3409]
[3410]
[3411]
[3412]
[3413]
[3414]
[3415]
[3416]
[3417]
[3418]
[3419]
[3420]
[3421]
[3422]
[3423]
[3424]
[3425]
[3426]
[3427]
[3428]
[3429]
[3430]
[3431]
[3432]
[3433]
[3434]
[3435]
[3436]
[3437]
[3438]
[3439]
[3440]
[3441]
[3442]
[3443]
[3444]
[3445]
[3446]
[3447]
[3448]
[3449]
[3450]
[3451]
[3452]
[3453]
[3454]
[3455]
[3456]
[3457]
[3458]
[3459]
[3460]
[3461]
[3462]
[3463]
[3464]
[3465]
[3466]
[3467]
[3468]
[3469]
[3470]
[3471]
[3472]
[3473]
[3474]
[3475]
[3476]
[3477]
[3478]
[3479]
[3480]
[3481]
[3482]
[3483]
[3484]
[3485]
[3486]
[3487]
[3488]
[3489]
[3490]
[3491]
[3492]
[3493]
[3494]
[3495]
[3496]
[3497]
[3498]
[3499]
[3500]
[3501]
[3502]
[3503]
[3504]
[3505]
[3506]
[3507]
[3508]
[3509]
[3510]
[3511]
[3512]
[3513]
[3514]
[3515]
[3516]
[3517]
[3518]
[3519]
[3520]
[3521]
[3522]
[3523]
[3524]
[3525]
[3526]
[3527]
[3528]
[3529]
[3530]
[3531]
[3532]
[3533]
[3534]
[3535]
[3536]
[3537]
[3538]
[3539]
[3540]
[3541]
[3542]
[3543]
[3544]
[3545]
[3546]
[3547]
[3548]
[3549]
[3550]
[3551]
[3552]
[3553]
[3554]
[3555]
[3556]
[3557]
[3558]
[3559]
[3560]
[3561]
[3562]
[3563]
[3564]
[3565]
[3566]
[3567]
[3568]
[3569]
[3570]
[3571]
[3572]
[3573]
[3574]
[3575]
[3576]
[3577]
[3578]
[3579]
[3580]
[3581]
[3582]
[3583]
[3584]
[3585]
[3586]
[3587]
[3588]
[3589]
[3590]
[3591]
[3592]
[3593]
[3594]
[3595]
[3596]
[3597]
[3598]
[3599]
[3600]
[3601]
[3602]
[3603]
[3604]
[3605]
[3606]
[3607]
[3608]
[3609]
[3610]
[3611]
[3612]
[3613]
[3614]
[3615]
[3616]
[3617]
[3618]
[3619]
[3620]
[3621]
[3622]
[3623]
[3624]
[3625]
[3626]
[3627]
[3628]
[3629]
[3630]
[3631]
[3632]
[3633]
[3634]
[3635]
[3636]
[3637]
[3638]
[3639]
[3640]
[3641]
[3642]
[3643]
[3644]
[3645]
[3646]
[3647]
[3648]
[3649]
[3650]
[3651]
[3652]
[3653]
[3654]
[3655]
[3656]
[3657]
[3658]
[3659]
[3660]
[3661]
[3662]
[3663]
[3664]
[3665]
[3666]
[3667]
[3668]
[3669]
[3670]
[3671]
[3672]
[3673]
[3674]
[3675]
[3676]
[3677]
[3678]
[3679]
[3680]
[3681]
[3682]
[3683]
[3684]
[3685]
[3686]
[3687]
[3688]
[3689]
[3690]
[3691]
[3692]
[3693]
[3694]
[3695]
[3696]
[3697]
[3698]
[3699]
[3700]
[3701]
[3702]
[3703]
[3704]
[3705]
[3706]
[3707]
[3708]
[3709]
[3710]
[3711]
[3712]
[3713]
[3714]
[3715]
[3716]
[3717]
[3718]
[3719]
[3720]
[3721]
[3722]
[3723]
[3724]
[3725]
[3726]
[3727]
[3728]
[3729]
[3730]
[3731]
[3732]
[3733]
[3734]
[3735]
[3736]
[3737]
[3738]
[3739]
[3740]
[3741]
[3742]
[3743]
[3744]
[3745]
[3746]
[3747]
[3748]
[3749]
[3750]
[3751]
[3752]
[3753]
[3754]
[3755]
[3756]
[3757]
[3758]
[3759]
[3760]
[3761]
[3762]
[3763]
[3764]
[3765]
[3766]
[3767]
[3768]
[3769]
[3770]
[3771]
[3772]
[3773]
[3774]
[3775]
[3776]
[3777]
[3778]
[3779]
[3780]
[3781]
[3782]
[3783]
[3784]
[3785]
[3786]
[3787]
[3788]
[3789]
[3790]
[3791]
[3792]
[3793]
[3794]
[3795]
[3796]
[3797]
[3798]
[3799]
[3800]
[3801]
[3802]
[3803]
[3804]
[3805]
[3806]
[3807]
[3808]
[3809]
[3810]
[3811]
[3812]
[3813]
[3814]
[3815]
[3816]
[3817]
[3818]
[3819]
[3820]
[3821]
[3822]
[3823]
[3824]
[3825]
[3826]
[3827]
[3828]
[3829]
[3830]
[3831]
[3832]
[3833]
[3834]
[3835]
[3836]
[3837]
[3838]
[3839]
[3840]
[3841]
[3842]
[3843]
[3844]
[3845]
[3846]
[3847]
[3848]
[3849]
[3850]
[3851]
[3852]
[3853]
[3854]
[3855]
[3856]
[3857]
[3858]
[3859]
[3860]
[3861]
[3862]
[3863]
[3864]
[3865]
[3866]
[3867]
[3868]
[3869]
[3870]
[3871]
[3872]
[3873]
[3874]
[3875]
[3876]
[3877]
[3878]
[3879]
[3880]
[3881]
[3882]
[3883]
[3884]
[3885]
[3886]
[3887]
[3888]
[3889]
[3890]
[3891]
[3892]
[3893]
[3894]
[3895]
[3896]
[3897]
[3898]
[3899]
[3900]
[3901]
[3902]
[3903]
[3904]
[3905]
[3906]
[3907]
[3908]
[3909]
[3910]
[3911]
[3912]
[3913]
[3914]
[3915]
[3916]
[3917]
[3918]
[3919]
[3920]
[3921]
[3922]
[3923]
[3924]
[3925]
[3926]
[3927]
[3928]
[3929]
[3930]
[3931]
[3932]
[3933]
[3934]
[3935]
[3936]
[3937]
[3938]
[3939]
[3940]
[3941]
[3942]
[3943]
[3944]
[3945]
[3946]
[3947]
[3948]
[3949]
[3950]
[3951]
[3952]
[3953]
[3954]
[3955]
[3956]
[3957]
[3958]
[3959]
[3960]
[3961]
[3962]
[3963]
[3964]
[3965]
[3966]
[3967]
[3968]
[3969]
[3970]
[3971]
[3972]
[3973]
[3974]
[3975]
[3976]
[3977]
[3978]
[3979]
[3980]
[3981]
[3982]
[3983]
[3984]
[3985]
[3986]
[3987]
[3988]
[3989]
[3990]
[3991]
[3992]
[3993]
[3994]
[3995]
[3996]
[3997]
[3998]
[3999]
[4000]
[4001]
[4002]
[4003]
[4004]
[4005]
[4006]
[4007]
[4008]
[4009]
[4010]
[4011]
[4012]
[4013]
[4014]
[4015]
[4016]
[4017]
[4018]
[4019]
[4020]
[4021]
[4022]
[4023]
[4024]
[4025]
[4026]
[4027]
[4028]
[4029]
[4030]
[4031]
[4032]
[4033]
[4034]
[4035]
[4036]
[4037]
[4038]
[4039]
[4040]
[4041]
[4042]
[4043]
[4044]
[4045]
[4046]
[4047]
[4048]
[4049]
[4050]
[4051]
[4052]
[4053]
[4054]
[4055]
[4056]
[4057]
[4058]
[4059]
[4060]
[4061]
[4062]
[4063]
[4064]
[4065]
[4066]
[4067]
[4068]
[4069]
[4070]
[4071]
[4072]
[4073]
[4074]
[4075]
[4076]
[4077]
[4078]
[4079]
[4080]
[4081]
[4082]
[4083]
[4084]
[4085]
[4086]
[4087]
[4088]
[4089]
[4090]
[4091]
[4092]
[4093]
[4094]
[4095]
[4096]
[4097]
[4098]
[4099]
[4100]
[4101]
[4102]
[4103]
[4104]
[4105]
[4106]
[4107]
[4108]
[4109]
[4110]
[4111]
[4112]
[4113]
[4114]
[4115]
[4116]
[4117]
[4118]
[4119]
[4120]
[4121]
[4122]
[4123]
[4124]
[4125]
[4126]
[4127]
[4128]
[4129]
[4130]
[4131]
[4132]
[4133]
[4134]
[4135]
[4136]
[4137]
[4138]
[4139]
[4140]
[4141]
[4142]
[4143]
[4144]
[4145]
[4146]
[4147]
[4148]
[4149]
[4150]
[4151]
[4152]
[4153]
[4154]
[4155]
[4156]
[4157]
[4158]
[4159]
[4160]
[4161]
[4162]
[4163]
[4164]
[4165]
[4166]
[4167]
[4168]
[4169]
[4170]
[4171]
[4172]
[4173]
[4174]
[4175]
[4176]
[4177]
[4178]
[4179]
[4180]
[4181]
[4182]
[4183]
[4184]
[4185]
[4186]
[4187]
[4188]
[4189]
[4190]
[4191]
[4192]
[4193]
[4194]
[4195]
[4196]
[4197]
[4198]
[4199]
[4200]
[4201]
[4202]
[4203]
[4204]
[4205]
[4206]
[4207]
[4208]
[4209]
[4210]
[4211]
[4212]
[4213]
[4214]
[4215]
[4216]
[4217]
[4218]
[4219]
[4220]
[4221]
[4222]
[4223]
[4224]
[4225]
[4226]
[4227]
[4228]
[4229]
[4230]
[4231]
[4232]
[4233]
[4234]
[4235]
[4236]
[4237]
[4238]
[4239]
[4240]
[4241]
[4242]
[4243]
[4244]
[4245]
[4246]
[4247]
[4248]
[4249]
[4250]
[4251]
[4252]
[4253]
[4254]
[4255]
[4256]
[4257]
[4258]
[4259]
[4260]
[4261]
[4262]
[4263]
[4264]
[4265]
[4266]
[4267]
[4268]
[4269]
[4270]
[4271]
[4272]
[4273]
[4274]
[4275]
[4276]
[4277]
[4278]
[4279]
[4280]
[4281]
[4282]
[4283]
[4284]
[4285]
[4286]
[4287]
[4288]
[4289]
[4290]
[4291]
[4292]
[4293]
[4294]
[4295]
[4296]
[4297]
[4298]
[4299]
[4300]
[4301]
[4302]
[4303]
[4304]
[4305]
[4306]
[4307]
[4308]
[4309]
[4310]
[4311]
[4312]
[4313]
[4314]
[4315]
[4316]
[4317]
[4318]
[4319]
[4320]
[4321]
[4322]
[4323]
[4324]
[4325]
[4326]
[4327]
[4328]
[4329]
[4330]
[4331]
[4332]
[4333]
[4334]
[4335]
[4336]
[4337]
[4338]
[4339]
[4340]
[4341]
[4342]
[4343]
[4344]
[4345]
[4346]
[4347]
[4348]
[4349]
[4350]
[4351]
[4352]
[4353]
[4354]
[4355]
[4356]
[4357]
[4358]
[4359]
[4360]
[4361]
[4362]
[4363]
[4364]
[4365]
[4366]
[4367]
[4368]
[4369]
[4370]
[4371]
[4372]
[4373]
[4374]
[4375]
[4376]
[4377]
[4378]
[4379]
[4380]
[4381]
[4382]
[4383]
[4384]
[4385]
[4386]
[4387]
[4388]
[4389]
[4390]
[4391]
[4392]
[4393]
[4394]
[4395]
[4396]
[4397]
[4398]
[4399]
[4400]
[4401]
[4402]
[4403]
[4404]
[4405]
[4406]
[4407]
[4408]
[4409]
[4410]
[4411]
[4412]
[4413]
[4414]
[4415]
[4416]
[4417]
[4418]
[4419]
[4420]
[4421]
[4422]
[4423]
[4424]
[4425]
[4426]
[4427]
[4428]
[4429]
[4430]
[4431]
[4432]
[4433]
[4434]
[4435]
[4436]
[4437]
[4438]
[4439]
[4440]
[4441]
[4442]
[4443]
[4444]
[4445]
[4446]
[4447]
[4448]
[4449]
[4450]
[4451]
[4452]
[4453]
[4454]
[4455]
[4456]
[4457]
[4458]
[4459]
[4460]
[4461]
[4462]
[4463]
[4464]
[4465]
[4466]
[4467]
[4468]
[4469]
[4470]
[4471]
[4472]
[4473]
[4474]
[4475]
[4476]
[4477]
[4478]
[4479]
[4480]
[4481]
[4482]
[4483]
[4484]
[4485]
[4486]
[4487]
[4488]
[4489]
[4490]
[4491]
[4492]
[4493]
[4494]
[4495]
[4496]
[4497]
[4498]
[4499]
[4500]
[4501]
[4502]
[4503]
[4504]
[4505]
[4506]
[4507]
[4508]
[4509]
[4510]
[4511]
[4512]
[4513]
[4514]
[4515]
[4516]
[4517]
[4518]
[4519]
[4520]
[4521]
[4522]
[4523]
[4524]
[4525]
[4526]
[4527]
[4528]
[4529]
[4530]
[4531]
[4532]
[4533]
[4534]
[4535]
[4536]
[4537]
[4538]
[4539]
[4540]
[4541]
[4542]
[4543]
[4544]
[4545]
[4546]
[4547]
[4548]
[4549]
[4550]
[4551]
[4552]
[4553]
[4554]
[4555]
[4556]
[4557]
[4558]
[4559]
[4560]
[4561]
[4562]
[4563]
[4564]
[4565]
[4566]
[4567]
[4568]
[4569]
[4570]
[4571]
[4572]
[4573]
[4574]
[4575]
[4576]
[4577]
[4578]
[4579]
[4580]
[4581]
[4582]
[4583]
[4584]
[4585]
[4586]
[4587]
[4588]
[4589]
[4590]
[4591]
[4592]
[4593]
[4594]
[4595]
[4596]
[4597]
[4598]
[4599]
[4600]
[4601]
[4602]
[4603]
[4604]
[4605]
[4606]
[4607]
[4608]
[4609]
[4610]
[4611]
[4612]
[4613]
[4614]
[4615]
[4616]
[4617]
[4618]
[4619]
[4620]
[4621]
[4622]
[4623]
[4624]
[4625]
[4626]
[4627]
[4628]
[4629]
[4630]
[4631]
[4632]
[4633]
[4634]
[4635]
[4636]
[4637]
[4638]
[4639]
[4640]
[4641]
[4642]
[4643]
[4644]
[4645]
[4646]
[4647]
[4648]
[4649]
[4650]
[4651]
[4652]
[4653]
[4654]
[4655]
[4656]
[4657]
[4658]
[4659]
[4660]
[4661]
[4662]
[4663]
[4664]
[4665]
[4666]
[4667]
[4668]
[4669]
[4670]
[4671]
[4672]
[4673]
[4674]
[4675]
[4676]
[4677]
[4678]
[4679]
[4680]
[4681]
[4682]
[4683]
[4684]
[4685]
[4686]
[4687]
[4688]
[4689]
[4690]
[4691]
[4692]
[4693]
[4694]
[4695]
[4696]
[4697]
[4698]
[4699]
[4700]
[4701]
[4702]
[4703]
[4704]
[4705]
[4706]
[4707]
[4708]
[4709]
[4710]
[4711]
[4712]
[4713]
[4714]
[4715]
[4716]
[4717]
[4718]
[4719]
[4720]
[4721]
[4722]
[4723]
[4724]
[4725]
[4726]
[4727]
[4728]
[4729]
[4730]
[4731]
[4732]
[4733]
[4734]
[4735]
[4736]
[4737]
[4738]
[4739]
[4740]
[4741]
[4742]
[4743]
[4744]
[4745]
[4746]
[4747]
[4748]
[4749]
[4750]
[4751]
[4752]
[4753]
[4754]
[4755]
[4756]
[4757]
[4758]
[4759]
[4760]
[4761]
[4762]
[4763]
[4764]
[4765]
[4766]
[4767]
[4768]
[4769]
[4770]
[4771]
[4772]
[4773]
[4774]
[4775]
[4776]
[4777]
[4778]
[4779]
[4780]
[4781]
[4782]
[4783]
[4784]
[4785]
[4786]
[4787]
[4788]
[4789]
[4790]
[4791]
[4792]
[4793]
[4794]
[4795]
[4796]
[4797]
[4798]
[4799]
[4800]
[4801]
[4802]
[4803]
[4804]
[4805]
[4806]
[4807]
[4808]
[4809]
[4810]
[4811]
[4812]
[4813]
[4814]
[4815]
[4816]
[4817]
[4818]
[4819]
[4820]
[4821]
[4822]
[4823]
[4824]
[4825]
[4826]
[4827]
[4828]
[4829]
[4830]
[4831]
[4832]
[4833]
[4834]
[4835]
[4836]
[4837]
[4838]
[4839]
[4840]
[4841]
[4842]
[4843]
[4844]
[4845]
[4846]
[4847]
[4848]
[4849]
[4850]
[4851]
[4852]
[4853]
[4854]
[4855]
[4856]
[4857]
[4858]
[4859]
[4860]
[4861]
[4862]
[4863]
[4864]
[4865]
[4866]
[4867]
[4868]
[4869]
[4870]
[4871]
[4872]
[4873]
[4874]
[4875]
[4876]
[4877]
[4878]
[4879]
[4880]
[4881]
[4882]
[4883]
[4884]
[4885]
[4886]
[4887]
[4888]
[4889]
[4890]
[4891]
[4892]
[4893]
[4894]
[4895]
[4896]
[4897]
[4898]
[4899]
[4900]
[4901]
[4902]
[4903]
[4904]
[4905]
[4906]
[4907]
[4908]
[4909]
[4910]
[4911]
[4912]
[4913]
[4914]
[4915]
[4916]
[4917]
[4918]
[4919]
[4920]
[4921]
[4922]
[4923]
[4924]
[4925]
[4926]
[4927]
[4928]
[4929]
[4930]
[4931]
[4932]
[4933]
[4934]
[4935]
[4936]
[4937]
[4938]
[4939]
[4940]
[4941]
[4942]
[4943]
[4944]
[4945]
[4946]
[4947]
[4948]
[4949]
[4950]
[4951]
[4952]
[4953]
[4954]
[4955]
[4956]
[4957]
[4958]
[4959]
[4960]
[4961]
[4962]
[4963]
[4964]
[4965]
[4966]
[4967]
[4968]
[4969]
[4970]
[4971]
[4972]
[4973]
[4974]
[4975]
[4976]
[4977]
[4978]
[4979]
[4980]
[4981]
[4982]
[4983]
[4984]
[4985]
[4986]
[4987]
[4988]
[4989]
[4990]
[4991]
[4992]
[4993]
[4994]
[4995]
[4996]
[4997]
[4998]
[4999]
[5000]
[5001]
[5002]
[5003]
[5004]
[5005]
[5006]
[5007]
[5008]
[5009]
[5010]
[5011]
[5012]
[5013]
[5014]
[5015]
[5016]
[5017]
[5018]
[5019]
[5020]
[5021]
[5022]
[5023]
[5024]
[5025]
[5026]
[5027]
[5028]
[5029]
[5030]
[5031]
[5032]
[5033]
[5034]
[5035]
[5036]
[5037]
[5038]
[5039]
[5040]
[5041]
[5042]
[5043]
[5044]
[5045]
[5046]
[5047]
[5048]
[5049]
[5050]
[5051]
[5052]
[5053]
[5054]
[5055]
[5056]
[5057]
[5058]
[5059]
[5060]
[5061]
[5062]
[5063]
[5064]
[5065]
[5066]
[5067]
[5068]
[5069]
[5070]
[5071]
[5072]
[5073]
[5074]
[5075]
[5076]
[5077]
[5078]
[5079]
[5080]
[5081]
[5082]
[5083]
[5084]
[5085]
[5086]
[5087]
[5088]
[5089]
[5090]
[5091]
[5092]
[5093]
[5094]
[5095]
[5096]
[5097]
[5098]
[5099]
[5100]
[5101]
[5102]
[5103]
[5104]
[5105]
[5106]
[5107]
[5108]
[5109]
[5110]
[5111]
[5112]
[5113]
[5114]
[5115]
[5116]
[5117]
[5118]
[5119]
[5120]
[5121]
[5122]
[5123]
[5124]
[5125]
[5126]
[5127]
[5128]
[5129]
[5130]
[5131]
[5132]
[5133]
[5134]
[5135]
[5136]
[5137]
[5138]
[5139]
[5140]
[5141]
[5142]
[5143]
[5144]
[5145]
[5146]
[5147]
[5148]
[5149]
[5150]
[5151]
[5152]
[5153]
[5154]
[5155]
[5156]
[5157]
[5158]
[5159]
[5160]
[5161]
[5162]
[5163]
[5164]
[5165]
[5166]
[5167]
[5168]
[5169]
[5170]
[5171]
[5172]
[5173]
[5174]
[5175]
[5176]
[5177]
[5178]
[5179]
[5180]
[5181]
[5182]
[5183]
[5184]
[5185]
[5186]
[5187]
[5188]
[5189]
[5190]
[5191]
[5192]
[5193]
[5194]
[5195]
[5196]
[5197]
[5198]
[5199]
[5200]
[5201]
[5202]
[5203]
[5204]
[5205]
[5206]
[5207]
[5208]
[5209]
[5210]
[5211]
[5212]
[5213]
[5214]
[5215]
[5216]
[5217]
[5218]
[5219]
[5220]
[5221]
[5222]
[5223]
[5224]
[5225]
[5226]
[5227]
[5228]
[5229]
[5230]
[5231]
[5232]
[5233]
[5234]
[5235]
[5236]
[5237]
[5238]
[5239]
[5240]
[5241]
[5242]
[5243]
[5244]
[5245]
[5246]
[5247]
[5248]
[5249]
[5250]
[5251]
[5252]
[5253]
[5254]
[5255]
[5256]
[5257]
[5258]
[5259]
[5260]
[5261]
[5262]
[5263]
[5264]
[5265]
[5266]
[5267]
[5268]
[5269]
[5270]
[5271]
[5272]
[5273]
[5274]
[5275]
[5276]
[5277]
[5278]
[5279]
[5280]
[5281]
[5282]
[5283]
[5284]
[5285]
[5286]
[5287]
[5288]
[5289]
[5290]
[5291]
[5292]
[5293]
[5294]
[5295]
[5296]
[5297]
[5298]
[5299]
[5300]
[5301]
[5302]
[5303]
[5304]
[5305]
[5306]
[5307]
[5308]
[5309]
[5310]
[5311]
[5312]
[5313]
[5314]
[5315]
[5316]
[5317]
[5318]
[5319]
[5320]
[5321]
[5322]
[5323]
[5324]
[5325]
[5326]
[5327]
[5328]
[5329]
[5330]
[5331]
[5332]
[5333]
[5334]
[5335]
[5336]
[5337]
[5338]
[5339]
[5340]
[5341]
[5342]
[5343]
[5344]
[5345]
[5346]
[5347]
[5348]
[5349]
[5350]
[5351]
[5352]
[5353]
[5354]
[5355]
[5356]
[5357]
[5358]
[5359]
[5360]
[5361]
[5362]
[5363]
[5364]
[5365]
[5366]
[5367]
[5368]
[5369]
[5370]
[5371]
[5372]
[5373]
[5374]
[5375]
[5376]
[5377]
[5378]
[5379]
[5380]
[5381]
[5382]
[5383]
[5384]
[5385]
[5386]
[5387]
[5388]
[5389]
[5390]
[5391]
[5392]
[5393]
[5394]
[5395]
[5396]
[5397]
[5398]
[5399]
[5400]
[5401]
[5402]
[5403]
[5404]
[5405]
[5406]
[5407]
[5408]
[5409]
[5410]
[5411]
[5412]
[5413]
[5414]
[5415]
[5416]
[5417]
[5418]
[5419]
[5420]
[5421]
[5422]
[5423]
[5424]
[5425]
[5426]
[5427]
[5428]
[5429]
[5430]
[5431]
[5432]
[5433]
[5434]
[5435]
[5436]
[5437]
[5438]
[5439]
[5440]
[5441]
[5442]
[5443]
[5444]
[5445]
[5446]
[5447]
[5448]
[5449]
[5450]
[5451]
[5452]
[5453]
[5454]
[5455]
[5456]
[5457]
[5458]
[5459]
[5460]
[5461]
[5462]
[5463]
[5464]
[5465]
[5466]
[5467]
[5468]
[5469]
[5470]
[5471]
[5472]
[5473]
[5474]
[5475]
[5476]
[5477]
[5478]
[5479]
[5480]
[5481]
[5482]
[5483]
[5484]
[5485]
[5486]
[5487]
[5488]
[5489]
[5490]
[5491]
[5492]
[5493]
[5494]
[5495]
[5496]
[5497]
[5498]
[5499]
[5500]
[5501]
[5502]
[5503]
[5504]
[5505]
[5506]
[5507]
[5508]
[5509]
[5510]
[5511]
[5512]
[5513]
[5514]
[5515]
[5516]
[5517]
[5518]
[5519]
[5520]
[5521]
[5522]
[5523]
[5524]
[5525]
[5526]
[5527]
[5528]
[5529]
[5530]
[5531]
[5532]
[5533]
[5534]
[5535]
[5536]
[5537]
[5538]
[5539]
[5540]
[5541]
[5542]
[5543]
[5544]
[5545]
[5546]
[5547]
[5548]
[5549]
[5550]
[5551]
[5552]
[5553]
[5554]
[5555]
[5556]
[5557]
[5558]
[5559]
[5560]
[5561]
[5562]
[5563]
[5564]
[5565]
[5566]
[5567]
[5568]
[5569]
[5570]
[5571]
[5572]
[5573]
[5574]
[5575]
[5576]
[5577]
[5578]
[5579]
[5580]
[5581]
[5582]
[5583]
[5584]
[5585]
[5586]
[5587]
[5588]
[5589]
[5590]
[5591]
[5592]
[5593]
[5594]
[5595]
[5596]
[5597]
[5598]
[5599]
[5600]
[5601]
[5602]
[5603]
[5604]
[5605]
[5606]
[5607]
[5608]
[5609]
[5610]
[5611]
[5612]
[5613]
[5614]
[5615]
[5616]
[5617]
[5618]
[5619]
[5620]
[5621]
[5622]
[5623]
[5624]
[5625]
[5626]
[5627]
[5628]
[5629]
[5630]
[5631]
[5632]
[5633]
[5634]
[5635]
[5636]
[5637]
[5638]
[5639]
[5640]
[5641]
[5642]
[5643]
[5644]
[5645]
[5646]
[5647]
[5648]
[5649]
[5650]
[5651]
[5652]
[5653]
[5654]
[5655]
[5656]
[5657]
[5658]
[5659]
[5660]
[5661]
[5662]
[5663]
[5664]
[5665]
[5666]
[5667]
[5668]
[5669]
[5670]
[5671]
[5672]
[5673]
[5674]
[5675]
[5676]
[5677]
[5678]
[5679]
[5680]
[5681]
[5682]
[5683]
[5684]
[5685]
[5686]
[5687]
[5688]
[5689]
[5690]
[5691]
[5692]
[5693]
[5694]
[5695]
[5696]
[5697]
[5698]
[5699]
[5700]
[5701]
[5702]
[5703]
[5704]
[5705]
[5706]
[5707]
[5708]
[5709]
[5710]
[5711]
[5712]
[5713]
[5714]
[5715]
[5716]
[5717]
[5718]
[5719]
[5720]
[5721]
[5722]
[5723]
[5724]
[5725]
[5726]
[5727]
[5728]
[5729]
[5730]
[5731]
[5732]
[5733]
[5734]
[5735]
[5736]
[5737]
[5738]
[5739]
[5740]
[5741]
[5742]
[5743]
[5744]
[5745]
[5746]
[5747]
[5748]
[5749]
[5750]
[5751]
[5752]
[5753]
[5754]
[5755]
[5756]
[5757]
[5758]
[5759]
[5760]
[5761]
[5762]
[5763]
[5764]
[5765]
[5766]
[5767]
[5768]
[5769]
[5770]
[5771]
[5772]
[5773]
[5774]
[5775]
[5776]
[5777]
[5778]
[5779]
[5780]
[5781]
[5782]
[5783]
[5784]
[5785]
[5786]
[5787]
[5788]
[5789]
[5790]
[5791]
[5792]
[5793]
[5794]
[5795]
[5796]
[5797]
[5798]
[5799]
[5800]
[5801]
[5802]
[5803]
[5804]
[5805]
[5806]
[5807]
[5808]
[5809]
[5810]
[5811]
[5812]
[5813]
[5814]
[5815]
[5816]
[5817]
[5818]
[5819]
[5820]
[5821]
[5822]
[5823]
[5824]
[5825]
[5826]
[5827]
[5828]
[5829]
[5830]
[5831]
[5832]
[5833]
[5834]
[5835]
[5836]
[5837]
[5838]
[5839]
[5840]
[5841]
[5842]
[5843]
[5844]
[5845]
[5846]
[5847]
[5848]
[5849]
[5850]
[5851]
[5852]
[5853]
[5854]
[5855]
[5856]
[5857]
[5858]
[5859]
[5860]
[5861]
[5862]
[5863]
[5864]
[5865]
[5866]
[5867]
[5868]
[5869]
[5870]
[5871]
[5872]
[5873]
[5874]
[5875]
[5876]
[5877]
[5878]
[5879]
[5880]
[5881]
[5882]
[5883]
[5884]
[5885]
[5886]
[5887]
[5888]
[5889]
[5890]
[5891]
[5892]
[5893]
[5894]
[5895]
[5896]
[5897]
[5898]
[5899]
[5900]
[5901]
[5902]
[5903]
[5904]
[5905]
[5906]
[5907]
[5908]
[5909]
[5910]
[5911]
[5912]
[5913]
[5914]
[5915]
[5916]
[5917]
[5918]
[5919]
[5920]
[5921]
[5922]
[5923]
[5924]
[5925]
[5926]
[5927]
[5928]
[5929]
[5930]
[5931]
[5932]
[5933]
[5934]
[5935]
[5936]
[5937]
[5938]
[5939]
[5940]
[5941]
[5942]
[5943]
[5944]
[5945]
[5946]
[5947]
[5948]
[5949]
[5950]
[5951]
[5952]
[5953]
[5954]
[5955]
[5956]
[5957]
[5958]
[5959]
[5960]
[5961]
[5962]
[5963]
[5964]
[5965]
[5966]
[5967]
[5968]
[5969]
[5970]
[5971]
[5972]
[5973]
[5974]
[5975]
[5976]
[5977]
[5978]
[5979]
[5980]
[5981]
[5982]
[5983]
[5984]
[5985]
[5986]
[5987]
[5988]
[5989]
[5990]
[5991]
[5992]
[5993]
[5994]
[5995]
[5996]
[5997]
[5998]
[5999]
[6000]
[6001]
[6002]
[6003]
[6004]
[6005]
[6006]
[6007]
[6008]
[6009]
[6010]
[6011]
[6012]
[6013]
[6014]
[6015]
[6016]
[6017]
[6018]
[6019]
[6020]
[6021]
[6022]
[6023]
[6024]
[6025]
[6026]
[6027]
[6028]
[6029]
[6030]
[6031]
[6032]
[6033]
[6034]
[6035]
[6036]
[6037]
[6038]
[6039]
[6040]
[6041]
[6042]
[6043]
[6044]
[6045]
[6046]
[6047]
[6048]
[6049]
[6050]
[6051]
[6052]
[6053]
[6054]
[6055]
[6056]
[6057]
[6058]
[6059]
[6060]
[6061]
[6062]
[6063]
[6064]
[6065]
[6066]
[6067]
[6068]
[6069]
[6070]
[6071]
[6072]
[6073]
[6074]
[6075]
[6076]
[6077]
[6078]
[6079]
[6080]
[6081]
[6082]
[6083]
[6084]
[6085]
[6086]
[6087]
[6088]
[6089]
[6090]
[6091]
[6092]
[6093]
[6094]
[6095]
[6096]
[6097]
[6098]
[6099]
[6100]
[6101]
[6102]
[6103]
[6104]
[6105]
[6106]
[6107]
[6108]
[6109]
[6110]
[6111]
[6112]
[6113]
[6114]
[6115]
[6116]
[6117]
[6118]
[6119]
[6120]
[6121]
[6122]
[6123]
[6124]
[6125]
[6126]
[6127]
[6128]
[6129]
[6130]
[6131]
[6132]
[6133]
[6134]
[6135]
[6136]
[6137]
[6138]
[6139]
[6140]
[6141]
[6142]
[6143]
[6144]
[6145]
[6146]
[6147]
[6148]
[6149]
[6150]
[6151]
[6152]
[6153]
[6154]
[6155]
[6156]
[6157]
[6158]
[6159]
[6160]
[6161]
[6162]
[6163]
[6164]
[6165]
[6166]
[6167]
[6168]
[6169]
[6170]
[6171]
[6172]
[6173]
[6174]
[6175]
[6176]
[6177]
[6178]
[6179]
[6180]
[6181]
[6182]
[6183]
[6184]
[6185]
[6186]
[6187]
[6188]
[6189]
[6190]
[6191]
[6192]
[6193]
[6194]
[6195]
[6196]
[6197]
[6198]
[6199]
[6200]
[6201]
[6202]
[6203]
[6204]
[6205]
[6206]
[6207]
[6208]
[6209]
[6210]
[6211]
[6212]
[6213]
[6214]
[6215]
[6216]
[6217]
[6218]
[6219]
[6220]
[6221]
[6222]
[6223]
[6224]
[6225]
[6226]
[6227]
[6228]
[6229]
[6230]
[6231]
[6232]
[6233]
[6234]
[6235]
[6236]
[6237]
[6238]
[6239]
[6240]
[6241]
[6242]
[6243]
[6244]
[6245]
[6246]
[6247]
[6248]
[6249]
[6250]
[6251]
[6252]
[6253]
[6254]
[6255]
[6256]
[6257]
[6258]
[6259]
[6260]
[6261]
[6262]
[6263]
[6264]
[6265]
[6266]
[6267]
[6268]
[6269]
[6270]
[6271]
[6272]
[6273]
[6274]
[6275]
[6276]
[6277]
[6278]
[6279]
[6280]
[6281]
[6282]
[6283]
[6284]
[6285]
[6286]
[6287]
[6288]
[6289]
[6290]
[6291]
[6292]
[6293]
[6294]
[6295]
[6296]
[6297]
[6298]
[6299]
[6300]
[6301]
[6302]
[6303]
[6304]
[6305]
[6306]
[6307]
[6308]
[6309]
[6310]
[6311]
[6312]
[6313]
[6314]
[6315]
[6316]
[6317]
[6318]
[6319]
[6320]
[6321]
[6322]
[6323]
[6324]
[6325]
[6326]
[6327]
[6328]
[6329]
[6330]
[6331]
[6332]
[6333]
[6334]
[6335]
[6336]
[6337]
[6338]
[6339]
[6340]
[6341]
[6342]
[6343]
[6344]
[6345]
[6346]
[6347]
[6348]
[6349]
[6350]
[6351]
[6352]
[6353]
[6354]
[6355]
[6356]
[6357]
[6358]
[6359]
[6360]
[6361]
[6362]
[6363]
[6364]
[6365]
[6366]
[6367]
[6368]
[6369]
[6370]
[6371]
[6372]
[6373]
[6374]
[6375]
[6376]
[6377]
[6378]
[6379]
[6380]
[6381]
[6382]
[6383]
[6384]
[6385]
[6386]
[6387]
[6388]
[6389]
[6390]
[6391]
[6392]
[6393]
[6394]
[6395]
[6396]
[6397]
[6398]
[6399]
[6400]
[6401]
[6402]
[6403]
[6404]
[6405]
[6406]
[6407]
[6408]
[6409]
[6410]
[6411]
[6412]
[6413]
[6414]
[6415]
[6416]
[6417]
[6418]
[6419]
[6420]
[6421]
[6422]
[6423]
[6424]
[6425]
[6426]
[6427]
[6428]
[6429]
[6430]
[6431]
[6432]
[6433]
[6434]
[6435]
[6436]
[6437]
[6438]
[6439]
[6440]
[6441]
[6442]
[6443]
[6444]
[6445]
[6446]
[6447]
[6448]
[6449]
[6450]
[6451]
[6452]
[6453]
[6454]
[6455]
[6456]
[6457]
[6458]
[6459]
[6460]
[6461]
[6462]
[6463]
[6464]
[6465]
[6466]
[6467]
[6468]
[6469]
[6470]
[6471]
[6472]
[6473]
[6474]
[6475]
[6476]
[6477]
[6478]
[6479]
[6480]
[6481]
[6482]
[6483]
[6484]
[6485]
[6486]
[6487]
[6488]
[6489]
[6490]
[6491]
[6492]
[6493]
[6494]
[6495]
[6496]
[6497]
[6498]
[6499]
[6500]
[6501]
[6502]
[6503]
[6504]
[6505]
[6506]
[6507]
[6508]
[6509]
[6510]
[6511]
[6512]
[6513]
[6514]
[6515]
[6516]
[6517]
[6518]
[6519]
[6520]
[6521]
[6522]
[6523]
[6524]
[6525]
[6526]
[6527]
[6528]
[6529]
[6530]
[6531]
[6532]
[6533]
[6534]
[6535]
[6536]
[6537]
[6538]
[6539]
[6540]
[6541]
[6542]
[6543]
[6544]
[6545]
[6546]
[6547]
[6548]
[6549]
[6550]
[6551]
[6552]
[6553]
[6554]
[6555]
[6556]
[6557]
[6558]
[6559]
[6560]
[6561]
[6562]
[6563]
[6564]
[6565]
[6566]
[6567]
[6568]
[6569]
[6570]
[6571]
[6572]
[6573]
[6574]
[6575]
[6576]
[6577]
[6578]
[6579]
[6580]
[6581]
[6582]
[6583]
[6584]
[6585]
[6586]
[6587]
[6588]
[6589]
[6590]
[6591]
[6592]
[6593]
[6594]
[6595]
[6596]
[6597]
[6598]
[6599]
[6600]
[6601]
[6602]
[6603]
[6604]
[6605]
[6606]
[6607]
[6608]
[6609]
[6610]
[6611]
[6612]
[6613]
[6614]
[6615]
[6616]
[6617]
[6618]
[6619]
[6620]
[6621]
[6622]
[6623]
[6624]
[6625]
[6626]
[6627]
[6628]
[6629]
[6630]
[6631]
[6632]
[6633]
[6634]
[6635]
[6636]
[6637]
[6638]
[6639]
[6640]
[6641]
[6642]
[6643]
[6644]
[6645]
[6646]
[6647]
[6648]
[6649]
[6650]
[6651]
[6652]
[6653]
[6654]
[6655]
[6656]
[6657]
[6658]
[6659]
[6660]
[6661]
[6662]
[6663]
[6664]
[6665]
[6666]
[6667]
[6668]
[6669]
[6670]
[6671]
[6672]
[6673]
[6674]
[6675]
[6676]
[6677]
[6678]
[6679]
[6680]
[6681]
[6682]
[6683]
[6684]
[6685]
[6686]
[6687]
[6688]
[6689]
[6690]
[6691]
[6692]
[6693]
[6694]
[6695]
[6696]
[6697]
[6698]
[6699]
[6700]
[6701]
[6702]
[6703]
[6704]
[6705]
[6706]
[6707]
[6708]
[6709]
[6710]
[6711]
[6712]
[6713]
[6714]
[6715]
[6716]
[6717]
[6718]
[6719]
[6720]
[6721]
[6722]
[6723]
[6724]
[6725]
[6726]
[6727]
[6728]
[6729]
[6730]
[6731]
[6732]
[6733]
[6734]
[6735]
[6736]
[6737]
[6738]
[6739]
[6740]
[6741]
[6742]
[6743]
[6744]
[6745]
[6746]
[6747]
[6748]
[6749]
[6750]
[6751]
[6752]
[6753]
[6754]
[6755]
[6756]
[6757]
[6758]
[6759]
[6760]
[6761]
[6762]
[6763]
[6764]
[6765]
[6766]
[6767]
[6768]
[6769]
[6770]
[6771]
[6772]
[6773]
[6774]
[6775]
[6776]
[6777]
[6778]
[6779]
[6780]
[6781]
[6782]
[6783]
[6784]
[6785]
[6786]
[6787]
[6788]
[6789]
[6790]
[6791]
[6792]
[6793]
[6794]
[6795]
[6796]
[6797]
[6798]
[6799]
[6800]
[6801]
[6802]
[6803]
[6804]
[6805]
[6806]
[6807]
[6808]
[6809]
[6810]
[6811]
[6812]
[6813]
[6814]
[6815]
[6816]
[6817]
[6818]
[6819]
[6820]
[6821]
[6822]
[6823]
[6824]
[6825]
[6826]
[6827]
[6828]
[6829]
[6830]
[6831]
[6832]
[6833]
[6834]
[6835]
[6836]
[6837]
[6838]
[6839]
[6840]
[6841]
[6842]
[6843]
[6844]
[6845]
[6846]
[6847]
[6848]
[6849]
[6850]
[6851]
[6852]
[6853]
[6854]
[6855]
[6856]
[6857]
[6858]
[6859]
[6860]
[6861]
[6862]
[6863]
[6864]
[6865]
[6866]
[6867]
[6868]
[6869]
[6870]
[6871]
[6872]
[6873]
[6874]
[6875]
[6876]
[6877]
[6878]
[6879]
[6880]
[6881]
[6882]
[6883]
[6884]
[6885]
[6886]
[6887]
[6888]
[6889]
[6890]
[6891]
[6892]
[6893]
[6894]
[6895]
[6896]
[6897]
[6898]
[6899]
[6900]
[6901]
[6902]
[6903]
[6904]
[6905]
[6906]
[6907]
[6908]
[6909]
[6910]
[6911]
[6912]
[6913]
[6914]
[6915]
[6916]
[6917]
[6918]
[6919]
[6920]
[6921]
[6922]
[6923]
[6924]
[6925]
[6926]
[6927]
[6928]
[6929]
[6930]
[6931]
[6932]
[6933]
[6934]
[6935]
[6936]
[6937]
[6938]
[6939]
[6940]
[6941]
[6942]
[6943]
[6944]
[6945]
[6946]
[6947]
[6948]
[6949]
[6950]
[6951]
[6952]
[6953]
[6954]
[6955]
[6956]
[6957]
[6958]
[6959]
[6960]
[6961]
[6962]
[6963]
[6964]
[6965]
[6966]
[6967]
[6968]
[6969]
[6970]
[6971]
[6972]
[6973]
[6974]
[6975]
[6976]
[6977]
[6978]
[6979]
[6980]
[6981]
[6982]
[6983]
[6984]
[6985]
[6986]
[6987]
[6988]
[6989]
[6990]
[6991]
[6992]
[6993]
[6994]
[6995]
[6996]
[6997]
[6998]
[6999]
[7000]
[7001]
[7002]
[7003]
[7004]
[7005]
[7006]
[7007]
[7008]
[7009]
[7010]
[7011]
[7012]
[7013]
[7014]
[7015]
[7016]
[7017]
[7018]
[7019]
[7020]
[7021]
[7022]
[7023]
[7024]
[7025]
[7026]
[7027]
[7028]
[7029]
[7030]
[7031]
[7032]
[7033]
[7034]
[7035]
[7036]
[7037]
[7038]
[7039]
[7040]
[7041]
[7042]
[7043]
[7044]
[7045]
[7046]
[7047]
[7048]
[7049]
[7050]
[7051]
[7052]
[7053]
[7054]
[7055]
[7056]
[7057]
[7058]
[7059]
[7060]
[7061]
[7062]
[7063]
[7064]
[7065]
[7066]
[7067]
[7068]
[7069]
[7070]
[7071]
[7072]
[7073]
[7074]
[7075]
[7076]
[7077]
[7078]
[7079]
[7080]
[7081]
[7082]
[7083]
[7084]
[7085]
[7086]
[7087]
[7088]
[7089]
[7090]
[7091]
[7092]
[7093]
[7094]
[7095]
[7096]
[7097]
[7098]
[7099]
[7100]
[7101]
[7102]
[7103]
[7104]
[7105]
[7106]
[7107]
[7108]
[7109]
[7110]
[7111]
[7112]
[7113]
[7114]
[7115]
[7116]
[7117]
[7118]
[7119]
[7120]
[7121]
[7122]
[7123]
[7124]
[7125]
[7126]
[7127]
[7128]
[7129]
[7130]
[7131]
[7132]
[7133]
[7134]
[7135]
[7136]
[7137]
[7138]
[7139]
[7140]
[7141]
[7142]
[7143]
[7144]
[7145]
[7146]
[7147]
[7148]
[7149]
[7150]
[7151]
[7152]
[7153]
[7154]
[7155]
[7156]
[7157]
[7158]
[7159]
[7160]
[7161]
[7162]
[7163]
[7164]
[7165]
[7166]
[7167]
[7168]
[7169]
[7170]
[7171]
[7172]
[7173]
[7174]
[7175]
[7176]
[7177]
[7178]
[7179]
[7180]
[7181]
[7182]
[7183]
[7184]
[7185]
[7186]
[7187]
[7188]
[7189]
[7190]
[7191]
[7192]
[7193]
[7194]
[7195]
[7196]
[7197]
[7198]
[7199]
[7200]
[7201]
[7202]
[7203]
[7204]
[7205]
[7206]
[7207]
[7208]
[7209]
[7210]
[7211]
[7212]
[7213]
[7214]
[7215]
[7216]
[7217]
[7218]
[7219]
[7220]
[7221]
[7222]
[7223]
[7224]
[7225]
[7226]
[7227]
[7228]
[7229]
[7230]
[7231]
[7232]
[7233]
[7234]
[7235]
[7236]
[7237]
[7238]
[7239]
[7240]
[7241]
[7242]
[7243]
[7244]
[7245]
[7246]
[7247]
[7248]
[7249]
[7250]
[7251]
[7252]
[7253]
[7254]
[7255]
[7256]
[7257]
[7258]
[7259]
[7260]
[7261]
[7262]
[7263]
[7264]
[7265]
[7266]
[7267]
[7268]
[7269]
[7270]
[7271]
[7272]
[7273]
[7274]
[7275]
[7276]
[7277]
[7278]
[7279]
[7280]
[7281]
[7282]
[7283]
[7284]
[7285]
[7286]
[7287]
[7288]
[7289]
[7290]
[7291]
[7292]
[7293]
[7294]
[7295]
[7296]
[7297]
[7298]
[7299]
[7300]
[7301]
[7302]
[7303]
[7304]
[7305]
[7306]
[7307]
[7308]
[7309]
[7310]
[7311]
[7312]
[7313]
[7314]
[7315]
[7316]
[7317]
[7318]
[7319]
[7320]
[7321]
[7322]
[7323]
[7324]
[7325]
[7326]
[7327]
[7328]
[7329]
[7330]
[7331]
[7332]
[7333]
[7334]
[7335]
[7336]
[7337]
[7338]
[7339]
[7340]
[7341]
[7342]
[7343]
[7344]
[7345]
[7346]
[7347]
[7348]
[7349]
[7350]
[7351]
[7352]
[7353]
[7354]
[7355]
[7356]
[7357]
[7358]
[7359]
[7360]
[7361]
[7362]
[7363]
[7364]
[7365]
[7366]
[7367]
[7368]
[7369]
[7370]
[7371]
[7372]
[7373]
[7374]
[7375]
[7376]
[7377]
[7378]
[7379]
[7380]
[7381]
[7382]
[7383]
[7384]
[7385]
[7386]
[7387]
[7388]
[7389]
[7390]
[7391]
[7392]
[7393]
[7394]
[7395]
[7396]
[7397]
[7398]
[7399]
[7400]
[7401]
[7402]
[7403]
[7404]
[7405]
[7406]
[7407]
[7408]
[7409]
[7410]
[7411]
[7412]
[7413]
[7414]
[7415]
[7416]
[7417]
[7418]
[7419]
[7420]
[7421]
[7422]
[7423]
[7424]
[7425]
[7426]
[7427]
[7428]
[7429]
[7430]
[7431]
[7432]
[7433]
[7434]
[7435]
[7436]
[7437]
[7438]
[7439]
[7440]
[7441]
[7442]
[7443]
[7444]
[7445]
[7446]
[7447]
[7448]
[7449]
[7450]
[7451]
[7452]
[7453]
[7454]
[7455]
[7456]
[7457]
[7458]
[7459]
[7460]
[7461]
[7462]
[7463]
[7464]
[7465]
[7466]
[7467]
[7468]
[7469]
[7470]
[7471]
[7472]
[7473]
[7474]
[7475]
[7476]
[7477]
[7478]
[7479]
[7480]
[7481]
[7482]
[7483]
[7484]
[7485]
[7486]
[7487]
[7488]
[7489]
[7490]
[7491]
[7492]
[7493]
[7494]
[7495]
[7496]
[7497]
[7498]
[7499]
[7500]
[7501]
[7502]
[7503]
[7504]
[7505]
[7506]
[7507]
[7508]
[7509]
[7510]
[7511]
[7512]
[7513]
[7514]
[7515]
[7516]
[7517]
[7518]
[7519]
[7520]
[7521]
[7522]
[7523]
[7524]
[7525]
[7526]
[7527]
[7528]
[7529]
[7530]
[7531]
[7532]
[7533]
[7534]
[7535]
[7536]
[7537]
[7538]
[7539]
[7540]
[7541]
[7542]
[7543]
[7544]
[7545]
[7546]
[7547]
[7548]
[7549]
[7550]
[7551]
[7552]
[7553]
[7554]
[7555]
[7556]
[7557]
[7558]
[7559]
[7560]
[7561]
[7562]
[7563]
[7564]
[7565]
[7566]
[7567]
[7568]
[7569]
[7570]
[7571]
[7572]
[7573]
[7574]
[7575]
[7576]
[7577]
[7578]
[7579]
[7580]
[7581]
[7582]
[7583]
[7584]
[7585]
[7586]
[7587]
[7588]
[7589]
[7590]
[7591]
[7592]
[7593]
[7594]
[7595]
[7596]
[7597]
[7598]
[7599]
[7600]
[7601]
[7602]
[7603]
[7604]
[7605]
[7606]
[7607]
[7608]
[7609]
[7610]
[7611]
[7612]
[7613]
[7614]
[7615]
[7616]
[7617]
[7618]
[7619]
[7620]
[7621]
[7622]
[7623]
[7624]
[7625]
[7626]
[7627]
[7628]
[7629]
[7630]
[7631]
[7632]
[7633]
[7634]
[7635]
[7636]
[7637]
[7638]
[7639]
[7640]
[7641]
[7642]
[7643]
[7644]
[7645]
[7646]
[7647]
[7648]
[7649]
[7650]
[7651]
[7652]
[7653]
[7654]
[7655]
[7656]
[7657]
[7658]
[7659]
[7660]
[7661]
[7662]
[7663]
[7664]
[7665]
[7666]
[7667]
[7668]
[7669]
[7670]
[7671]
[7672]
[7673]
[7674]
[7675]
[7676]
[7677]
[7678]
[7679]
[7680]
[7681]
[7682]
[7683]
[7684]
[7685]
[7686]
[7687]
[7688]
[7689]
[7690]
[7691]
[7692]
[7693]
[7694]
[7695]
[7696]
[7697]
[7698]
[7699]
[7700]
[7701]
[7702]
[7703]
[7704]
[7705]
[7706]
[7707]
[7708]
[7709]
[7710]
[7711]
[7712]
[7713]
[7714]
[7715]
[7716]
[7717]
[7718]
[7719]
[7720]
[7721]
[7722]
[7723]
[7724]
[7725]
[7726]
[7727]
[7728]
[7729]
[7730]
[7731]
[7732]
[7733]
[7734]
[7735]
[7736]
[7737]
[7738]
[7739]
[7740]
[7741]
[7742]
[7743]
[7744]
[7745]
[7746]
[7747]
[7748]
[7749]
[7750]
[7751]
[7752]
[7753]
[7754]
[7755]
[7756]
[7757]
[7758]
[7759]
[7760]
[7761]
[7762]
[7763]
[7764]
[7765]
[7766]
[7767]
[7768]
[7769]
[7770]
[7771]
[7772]
[7773]
[7774]
[7775]
[7776]
[7777]
[7778]
[7779]
[7780]
[7781]
[7782]
[7783]
[7784]
[7785]
[7786]
[7787]
[7788]
[7789]
[7790]
[7791]
[7792]
[7793]
[7794]
[7795]
[7796]
[7797]
[7798]
[7799]
[7800]
[7801]
[7802]
[7803]
[7804]
[7805]
[7806]
[7807]
[7808]
[7809]
[7810]
[7811]
[7812]
[7813]
[7814]
[7815]
[7816]
[7817]
[7818]
[7819]
[7820]
[7821]
[7822]
[7823]
[7824]
[7825]
[7826]
[7827]
[7828]
[7829]
[7830]
[7831]
[7832]
[7833]
[7834]
[7835]
[7836]
[7837]
[7838]
[7839]
[7840]
[7841]
[7842]
[7843]
[7844]
[7845]
[7846]
[7847]
[7848]
[7849]
[7850]
[7851]
[7852]
[7853]
[7854]
[7855]
[7856]
[7857]
[7858]
[7859]
[7860]
[7861]
[7862]
[7863]
[7864]
[7865]
[7866]
[7867]
[7868]
[7869]
[7870]
[7871]
[7872]
[7873]
[7874]
[7875]
[7876]
[7877]
[7878]
[7879]
[7880]
[7881]
[7882]
[7883]
[7884]
[7885]
[7886]
[7887]
[7888]
[7889]
[7890]
[7891]
[7892]
[7893]
[7894]
[7895]
[7896]
[7897]
[7898]
[7899]
[7900]
[7901]
[7902]
[7903]
[7904]
[7905]
[7906]
[7907]
[7908]
[7909]
[7910]
[7911]
[7912]
[7913]
[7914]
[7915]
[7916]
[7917]
[7918]
[7919]
[7920]
[7921]
[7922]
[7923]
[7924]
[7925]
[7926]
[7927]
[7928]
[7929]
[7930]
[7931]
[7932]
[7933]
[7934]
[7935]
[7936]
[7937]
[7938]
[7939]
[7940]
[7941]
[7942]
[7943]
[7944]
[7945]
[7946]
[7947]
[7948]
[7949]
[7950]
[7951]
[7952]
[7953]
[7954]
[7955]
[7956]
[7957]
[7958]
[7959]
[7960]
[7961]
[7962]
[7963]
[7964]
[7965]
[7966]
[7967]
[7968]
[7969]
[7970]
[7971]
[7972]
[7973]
[7974]
[7975]
[7976]
[7977]
[7978]
[7979]
[7980]
[7981]
[7982]
[7983]
[7984]
[7985]
[7986]
[7987]
[7988]
[7989]
[7990]
[7991]
[7992]
[7993]
[7994]
[7995]
[7996]
[7997]
[7998]
[7999]
[8000]
[8001]
[8002]
[8003]
[8004]
[8005]
[8006]
[8007]
[8008]
[8009]
[8010]
[8011]
[8012]
[8013]
[8014]
[8015]
[8016]
[8017]
[8018]
[8019]
[8020]
[8021]
[8022]
[8023]
[8024]
[8025]
[8026]
[8027]
[8028]
[8029]
[8030]
[8031]
[8032]
[8033]
[8034]
[8035]
[8036]
[8037]
[8038]
[8039]
[8040]
[8041]
[8042]
[8043]
[8044]
[8045]
[8046]
[8047]
[8048]
[8049]
[8050]
[8051]
[8052]
[8053]
[8054]
[8055]
[8056]
[8057]
[8058]
[8059]
[8060]
[8061]
[8062]
[8063]
[8064]
[8065]
[8066]
[8067]
[8068]
[8069]
[8070]
[8071]
[8072]
[8073]
[8074]
[8075]
[8076]
[8077]
[8078]
[8079]
[8080]
[8081]
[8082]
[8083]
[8084]
[8085]
[8086]
[8087]
[8088]
[8089]
[8090]
[8091]
[8092]
[8093]
[8094]
[8095]
[8096]
[8097]
[8098]
[8099]
[8100]
[8101]
[8102]
[8103]
[8104]
[8105]
[8106]
[8107]
[8108]
[8109]
[8110]
[8111]
[8112]
[8113]
[8114]
[8115]
[8116]
[8117]
[8118]
[8119]
[8120]
[8121]
[8122]
[8123]
[8124]
[8125]
[8126]
[8127]
[8128]
[8129]
[8130]
[8131]
[8132]
[8133]
[8134]
[8135]
[8136]
[8137]
[8138]
[8139]
[8140]
[8141]
[8142]
[8143]
[8144]
[8145]
[8146]
[8147]
[8148]
[8149]
[8150]
[8151]
[8152]
[8153]
[8154]
[8155]
[8156]
[8157]
[8158]
[8159]
[8160]
[8161]
[8162]
[8163]
[8164]
[8165]
[8166]
[8167]
[8168]
[8169]
[8170]
[8171]
[8172]
[8173]
[8174]
[8175]
[8176]
[8177]
[8178]
[8179]
[8180]
[8181]
[8182]
[8183]
[8184]
[8185]
[8186]
[8187]
[8188]
[8189]
[8190]
[8191]
[8192]
[8193]
[8194]
[8195]
[8196]
[8197]
[8198]
[8199]
[8200]
[8201]
[8202]
[8203]
[8204]
[8205]
[8206]
[8207]
[8208]
[8209]
[8210]
[8211]
[8212]
[8213]
[8214]
[8215]
[8216]
[8217]
[8218]
[8219]
[8220]
[8221]
[8222]
[8223]
[8224]
[8225]
[8226]
[8227]
[8228]
[8229]
[8230]
[8231]
[8232]
[8233]
[8234]
[8235]
[8236]
[8237]
[8238]
[8239]
[8240]
[8241]
[8242]
[8243]
[8244]
[8245]
[8246]
[8247]
[8248]
[8249]
[8250]
[8251]
[8252]
[8253]
[8254]
[8255]
[8256]
[8257]
[8258]
[8259]
[8260]
[8261]
[8262]
[8263]
[8264]
[8265]
[8266]
[8267]
[8268]
[8269]
[8270]
[8271]
[8272]
[8273]
[8274]
[8275]
[8276]
[8277]
[8278]
[8279]
[8280]
[8281]
[8282]
[8283]
[8284]
[8285]
[8286]
[8287]
[8288]
[8289]
[8290]
[8291]
[8292]
[8293]
[8294]
[8295]
[8296]
[8297]
[8298]
[8299]
[8300]
[8301]
[8302]
[8303]
[8304]
[8305]
[8306]
[8307]
[8308]
[8309]
[8310]
[8311]
[8312]
[8313]
[8314]
[8315]
[8316]
[8317]
[8318]
[8319]
[8320]
[8321]
[8322]
[8323]
[8324]
[8325]
[8326]
[8327]
[8328]
[8329]
[8330]
[8331]
[8332]
[8333]
[8334]
[8335]
[8336]
[8337]
[8338]
[8339]
[8340]
[8341]
[8342]
[8343]
[8344]
[8345]
[8346]
[8347]
[8348]
[8349]
[8350]
[8351]
[8352]
[8353]
[8354]
[8355]
[8356]
[8357]
[8358]
[8359]
[8360]
[8361]
[8362]
[8363]
[8364]
[8365]
[8366]
[8367]
[8368]
[8369]
[8370]
[8371]
[8372]
[8373]
[8374]
[8375]
[8376]
[8377]
[8378]
[8379]
[8380]
[8381]
[8382]
[8383]
[8384]
[8385]
[8386]
[8387]
[8388]
[8389]
[8390]
[8391]
[8392]
[8393]
[8394]
[8395]
[8396]
[8397]
[8398]
[8399]
[8400]
[8401]
[8402]
[8403]
[8404]
[8405]
[8406]
[8407]
[8408]
[8409]
[8410]
[8411]
[8412]
[8413]
[8414]
[8415]
[8416]
[8417]
[8418]
[8419]
[8420]
[8421]
[8422]
[8423]
[8424]
[8425]
[8426]
[8427]
[8428]
[8429]
[8430]
[8431]
[8432]
[8433]
[8434]
[8435]
[8436]
[8437]
[8438]
[8439]
[8440]
[8441]
[8442]
[8443]
[8444]
[8445]
[8446]
[8447]
[8448]
[8449]
[8450]
[8451]
[8452]
[8453]
[8454]
[8455]
[8456]
[8457]
[8458]
[8459]
[8460]
[8461]
[8462]
[8463]
[8464]
[8465]
[8466]
[8467]
[8468]
[8469]
[8470]
[8471]
[8472]
[8473]
[8474]
[8475]
[8476]
[8477]
[8478]
[8479]
[8480]
[8481]
[8482]
[8483]
[8484]
[8485]
[8486]
[8487]
[8488]
[8489]
[8490]
[8491]
[8492]
[8493]
[8494]
[8495]
[8496]
[8497]
[8498]
[8499]
[8500]
[8501]
[8502]
[8503]
[8504]
[8505]
[8506]
[8507]
[8508]
[8509]
[8510]
[8511]
[8512]
[8513]
[8514]
[8515]
[8516]
[8517]
[8518]
[8519]
[8520]
[8521]
[8522]
[8523]
[8524]
[8525]
[8526]
[8527]
[8528]
[8529]
[8530]
[8531]
[8532]
[8533]
[8534]
[8535]
[8536]
[8537]
[8538]
[8539]
[8540]
[8541]
[8542]
[8543]
[8544]
[8545]
[8546]
[8547]
[8548]
[8549]
[8550]
[8551]
[8552]
[8553]
[8554]
[8555]
[8556]
[8557]
[8558]
[8559]
[8560]
[8561]
[8562]
[8563]
[8564]
[8565]
[8566]
[8567]
[8568]
[8569]
[8570]
[8571]
[8572]
[8573]
[8574]
[8575]
[8576]
[8577]
[8578]
[8579]
[8580]
[8581]
[8582]
[8583]
[8584]
[8585]
[8586]
[8587]
[8588]
[8589]
[8590]
[8591]
[8592]
[8593]
[8594]
[8595]
[8596]
[8597]
[8598]
[8599]
[8600]
[8601]
[8602]
[8603]
[8604]
[8605]
[8606]
[8607]
[8608]
[8609]
[8610]
[8611]
[8612]
[8613]
[8614]
[8615]
[8616]
[8617]
[8618]
[8619]
[8620]
[8621]
[8622]
[8623]
[8624]
[8625]
[8626]
[8627]
[8628]
[8629]
[8630]
[8631]
[8632]
[8633]
[8634]
[8635]
[8636]
[8637]
[8638]
[8639]
[8640]
[8641]
[8642]
[8643]
[8644]
[8645]
[8646]
[8647]
[8648]
[8649]
[8650]
[8651]
[8652]
[8653]
[8654]
[8655]
[8656]
[8657]
[8658]
[8659]
[8660]
[8661]
[8662]
[8663]
[8664]
[8665]
[8666]
[8667]
[8668]
[8669]
[8670]
[8671]
[8672]
[8673]
[8674]
[8675]
[8676]
[8677]
[8678]
[8679]
[8680]
[8681]
[8682]
[8683]
[8684]
[8685]
[8686]
[8687]
[8688]
[8689]
[8690]
[8691]
[8692]
[8693]
[8694]
[8695]
[8696]
[8697]
[8698]
[8699]
[8700]
[8701]
[8702]
[8703]
[8704]
[8705]
[8706]
[8707]
[8708]
[8709]
[8710]
[8711]
[8712]
[8713]
[8714]
[8715]
[8716]
[8717]
[8718]
[8719]
[8720]
[8721]
[8722]
[8723]
[8724]
[8725]
[8726]
[8727]
[8728]
[8729]
[8730]
[8731]
[8732]
[8733]
[8734]
[8735]
[8736]
[8737]
[8738]
[8739]
[8740]
[8741]
[8742]
[8743]
[8744]
[8745]
[8746]
[8747]
[8748]
[8749]
[8750]
[8751]
[8752]
[8753]
[8754]
[8755]
[8756]
[8757]
[8758]
[8759]
[8760]
[8761]
[8762]
[8763]
[8764]
[8765]
[8766]
[8767]
[8768]
[8769]
[8770]
[8771]
[8772]
[8773]
[8774]
[8775]
[8776]
[8777]
[8778]
[8779]
[8780]
[8781]
[8782]
[8783]
[8784]
[8785]
[8786]
[8787]
[8788]
[8789]
[8790]
[8791]
[8792]
[8793]
[8794]
[8795]
[8796]
[8797]
[8798]
[8799]
[8800]
[8801]
[8802]
[8803]
[8804]
[8805]
[8806]
[8807]
[8808]
[8809]
[8810]
[8811]
[8812]
[8813]
[8814]
[8815]
[8816]
[8817]
[8818]
[8819]
[8820]
[8821]
[8822]
[8823]
[8824]
[8825]
[8826]
[8827]
[8828]
[8829]
[8830]
[8831]
[8832]
[8833]
[8834]
[8835]
[8836]
[8837]
[8838]
[8839]
[8840]
[8841]
[8842]
[8843]
[8844]
[8845]
[8846]
[8847]
[8848]
[8849]
[8850]
[8851]
[8852]
[8853]
[8854]
[8855]
[8856]
[8857]
[8858]
[8859]
[8860]
[8861]
[8862]
[8863]
[8864]
[8865]
[8866]
[8867]
[8868]
[8869]
[8870]
[8871]
[8872]
[8873]
[8874]
[8875]
[8876]
[8877]
[8878]
[8879]
[8880]
[8881]
[8882]
[8883]
[8884]
[8885]
[8886]
[8887]
[8888]
[8889]
[8890]
[8891]
[8892]
[8893]
[8894]
[8895]
[8896]
[8897]
[8898]
[8899]
[8900]
[8901]
[8902]
[8903]
[8904]
[8905]
[8906]
[8907]
[8908]
[8909]
[8910]
[8911]
[8912]
[8913]
[8914]
[8915]
[8916]
[8917]
[8918]
[8919]
[8920]
[8921]
[8922]
[8923]
[8924]
[8925]
[8926]
[8927]
[8928]
[8929]
[8930]
[8931]
[8932]
[8933]
[8934]
[8935]
[8936]
[8937]
[8938]
[8939]
[8940]
[8941]
[8942]
[8943]
[8944]
[8945]
[8946]
[8947]
[8948]
[8949]
[8950]
[8951]
[8952]
[8953]
[8954]
[8955]
[8956]
[8957]
[8958]
[8959]
[8960]
[8961]
[8962]
[8963]
[8964]
[8965]
[8966]
[8967]
[8968]
[8969]
[8970]
[8971]
[8972]
[8973]
[8974]
[8975]
[8976]
[8977]
[8978]
[8979]
[8980]
[8981]
[8982]
[8983]
[8984]
[8985]
[8986]
[8987]
[8988]
[8989]
[8990]
[8991]
[8992]
[8993]
[8994]
[8995]
[8996]
[8997]
[8998]
[8999]
[9000]
[9001]
[9002]
[9003]
[9004]
[9005]
[9006]
[9007]
[9008]
[9009]
[9010]
[9011]
[9012]
[9013]
[9014]
[9015]
[9016]
[9017]
[9018]
[9019]
[9020]
[9021]
[9022]
[9023]
[9024]
[9025]
[9026]
[9027]
[9028]
[9029]
[9030]
[9031]
[9032]
[9033]
[9034]
[9035]
[9036]
[9037]
[9038]
[9039]
[9040]
[9041]
[9042]
[9043]
[9044]
[9045]
[9046]
[9047]
[9048]
[9049]
[9050]
[9051]
[9052]
[9053]
[9054]
[9055]
[9056]
[9057]
[9058]
[9059]
[9060]
[9061]
[9062]
[9063]
[9064]
[9065]
[9066]
[9067]
[9068]
[9069]
[9070]
[9071]
[9072]
[9073]
[9074]
[9075]
[9076]
[9077]
[9078]
[9079]
[9080]
[9081]
[9082]
[9083]
[9084]
[9085]
[9086]
[9087]
[9088]
[9089]
[9090]
[9091]
[9092]
[9093]
[9094]
[9095]
[9096]
[9097]
[9098]
[9099]
[9100]
[9101]
[9102]
[9103]
[9104]
[9105]
[9106]
[9107]
[9108]
[9109]
[9110]
[9111]
[9112]
[9113]
[9114]
[9115]
[9116]
[9117]
[9118]
[9119]
[9120]
[9121]
[9122]
[9123]
[9124]
[9125]
[9126]
[9127]
[9128]
[9129]
[9130]
[9131]
[9132]
[9133]
[9134]
[9135]
[9136]
[9137]
[9138]
[9139]
[9140]
[9141]
[9142]
[9143]
[9144]
[9145]
[9146]
[9147]
[9148]
[9149]
[9150]
[9151]
[9152]
[9153]
[9154]
[9155]
[9156]
[9157]
[9158]
[9159]
[9160]
[9161]
[9162]
[9163]
[9164]
[9165]
[9166]
[9167]
[9168]
[9169]
[9170]
[9171]
[9172]
[9173]
[9174]
[9175]
[9176]
[9177]
[9178]
[9179]
[9180]
[9181]
[9182]
[9183]
[9184]
[9185]
[9186]
[9187]
[9188]
[9189]
[9190]
[9191]
[9192]
[9193]
[9194]
[9195]
[9196]
[9197]
[9198]
[9199]
[9200]
[9201]
[9202]
[9203]
[9204]
[9205]
[9206]
[9207]
[9208]
[9209]
[9210]
[9211]
[9212]
[9213]
[9214]
[9215]
[9216]
[9217]
[9218]
[9219]
[9220]
[9221]
[9222]
[9223]
[9224]
[9225]
[9226]
[9227]
[9228]
[9229]
[9230]
[9231]
[9232]
[9233]
[9234]
[9235]
[9236]
[9237]
[9238]
[9239]
[9240]
[9241]
[9242]
[9243]
[9244]
[9245]
[9246]
[9247]
[9248]
[9249]
[9250]
[9251]
[9252]
[9253]
[9254]
[9255]
[9256]
[9257]
[9258]
[9259]
[9260]
[9261]
[9262]
[9263]
[9264]
[9265]
[9266]
[9267]
[9268]
[9269]
[9270]
[9271]
[9272]
[9273]
[9274]
[9275]
[9276]
[9277]
[9278]
[9279]
[9280]
[9281]
[9282]
[9283]
[9284]
[9285]
[9286]
[9287]
[9288]
[9289]
[9290]
[9291]
[9292]
[9293]
[9294]
[9295]
[9296]
[9297]
[9298]
[9299]
[9300]
[9301]
[9302]
[9303]
[9304]
[9305]
[9306]
[9307]
[9308]
[9309]
[9310]
[9311]
[9312]
[9313]
[9314]
[9315]
[9316]
[9317]
[9318]
[9319]
[9320]
[9321]
[9322]
[9323]
[9324]
[9325]
[9326]
[9327]
[9328]
[9329]
[9330]
[9331]
[9332]
[9333]
[9334]
[9335]
[9336]
[9337]
[9338]
[9339]
[9340]
[9341]
[9342]
[9343]
[9344]
[9345]
[9346]
[9347]
[9348]
[9349]
[9350]
[9351]
[9352]
[9353]
[9354]
[9355]
[9356]
[9357]
[9358]
[9359]
[9360]
[9361]
[9362]
[9363]
[9364]
[9365]
[9366]
[9367]
[9368]
[9369]
[9370]
[9371]
[9372]
[9373]
[9374]
[9375]
[9376]
[9377]
[9378]
[9379]
[9380]
[9381]
[9382]
[9383]
[9384]
[9385]
[9386]
[9387]
[9388]
[9389]
[9390]
[9391]
[9392]
[9393]
[9394]
[9395]
[9396]
[9397]
[9398]
[9399]
[9400]
[9401]
[9402]
[9403]
[9404]
[9405]
[9406]
[9407]
[9408]
[9409]
[9410]
[9411]
[9412]
[9413]
[9414]
[9415]
[9416]
[9417]
[9418]
[9419]
[9420]
[9421]
[9422]
[9423]
[9424]
[9425]
[9426]
[9427]
[9428]
[9429]
[9430]
[9431]
[9432]
[9433]
[9434]
[9435]
[9436]
[9437]
[9438]
[9439]
[9440]
[9441]
[9442]
[9443]
[9444]
[9445]
[9446]
[9447]
[9448]
[9449]
[9450]
[9451]
[9452]
[9453]
[9454]
[9455]
[9456]
[9457]
[9458]
[9459]
[9460]
[9461]
[9462]
[9463]
[9464]
[9465]
[9466]
[9467]
[9468]
[9469]
[9470]
[9471]
[9472]
[9473]
[9474]
[9475]
[9476]
[9477]
[9478]
[9479]
[9480]
[9481]
[9482]
[9483]
[9484]
[9485]
[9486]
[9487]
[9488]
[9489]
[9490]
[9491]
[9492]
[9493]
[9494]
[9495]
[9496]
[9497]
[9498]
[9499]
[9500]
[9501]
[9502]
[9503]
[9504]
[9505]
[9506]
[9507]
[9508]
[9509]
[9510]
[9511]
[9512]
[9513]
[9514]
[9515]
[9516]
[9517]
[9518]
[9519]
[9520]
[9521]
[9522]
[9523]
[9524]
[9525]
[9526]
[9527]
[9528]
[9529]
[9530]
[9531]
[9532]
[9533]
[9534]
[9535]
[9536]
[9537]
[9538]
[9539]
[9540]
[9541]
[9542]
[9543]
[9544]
[9545]
[9546]
[9547]
[9548]
[9549]
[9550]
[9551]
[9552]
[9553]
[9554]
[9555]
[9556]
[9557]
[9558]
[9559]
[9560]
[9561]
[9562]
[9563]
[9564]
[9565]
[9566]
[9567]
[9568]
[9569]
[9570]
[9571]
[9572]
[9573]
[9574]
[9575]
[9576]
[9577]
[9578]
[9579]
[9580]
[9581]
[9582]
[9583]
[9584]
[9585]
[9586]
[9587]
[9588]
[9589]
[9590]
[9591]
[9592]
[9593]
[9594]
[9595]
[9596]
[9597]
[9598]
[9599]
[9600]
[9601]
[9602]
[9603]
[9604]
[9605]
[9606]
[9607]
[9608]
[9609]
[9610]
[9611]
[9612]
[9613]
[9614]
[9615]
[9616]
[9617]
[9618]
[9619]
[9620]
[9621]
[9622]
[9623]
[9624]
[9625]
[9626]
[9627]
[9628]
[9629]
[9630]
[9631]
[9632]
[9633]
[9634]
[9635]
[9636]
[9637]
[9638]
[9639]
[9640]
[9641]
[9642]
[9643]
[9644]
[9645]
[9646]
[9647]
[9648]
[9649]
[9650]
[9651]
[9652]
[9653]
[9654]
[9655]
[9656]
[9657]
[9658]
[9659]
[9660]
[9661]
[9662]
[9663]
[9664]
[9665]
[9666]
[9667]
[9668]
[9669]
[9670]
[9671]
[9672]
[9673]
[9674]
[9675]
[9676]
[9677]
[9678]
[9679]
[9680]
[9681]
[9682]
[9683]
[9684]
[9685]
[9686]
[9687]
[9688]
[9689]
[9690]
[9691]
[9692]
[9693]
[9694]
[9695]
[9696]
[9697]
[9698]
[9699]
[9700]
[9701]
[9702]
[9703]
[9704]
[9705]
[9706]
[9707]
[9708]
[9709]
[9710]
[9711]
[9712]
[9713]
[9714]
[9715]
[9716]
[9717]
[9718]
[9719]
[9720]
[9721]
[9722]
[9723]
[9724]
[9725]
[9726]
[9727]
[9728]
[9729]
[9730]
[9731]
[9732]
[9733]
[9734]
[9735]
[9736]
[9737]
[9738]
[9739]
[9740]
[9741]
[9742]
[9743]
[9744]
[9745]
[9746]
[9747]
[9748]
[9749]
[9750]
[9751]
[9752]
[9753]
[9754]
[9755]
[9756]
[9757]
[9758]
[9759]
[9760]
[9761]
[9762]
[9763]
[9764]
[9765]
[9766]
[9767]
[9768]
[9769]
[9770]
[9771]
[9772]
[9773]
[9774]
[9775]
[9776]
[9777]
[9778]
[9779]
[9780]
[9781]
[9782]
[9783]
[9784]
[9785]
[9786]
[9787]
[9788]
[9789]
[9790]
[9791]
[9792]
[9793]
[9794]
[9795]
[9796]
[9797]
[9798]
[9799]
[9800]
[9801]
[9802]
[9803]
[9804]
[9805]
[9806]
[9807]
[9808]
[9809]
[9810]
[9811]
[9812]
[9813]
[9814]
[9815]
[9816]
[9817]
[9818]
[9819]
[9820]
[9821]
[9822]
[9823]
[9824]
[9825]
[9826]
[9827]
[9828]
[9829]
[9830]
[9831]
[9832]
[9833]
[9834]
[9835]
[9836]
[9837]
[9838]
[9839]
[9840]
[9841]
[9842]
[9843]
[9844]
[9845]
[9846]
[9847]
[9848]
[9849]
[9850]
[9851]
[9852]
[9853]
[9854]
[9855]
[9856]
[9857]
[9858]
[9859]
[9860]
[9861]
[9862]
[9863]
[9864]
[9865]
[9866]
[9867]
[9868]
[9869]
[9870]
[9871]
[9872]
[9873]
[9874]
[9875]
[9876]
[9877]
[9878]
[9879]
[9880]
[9881]
[9882]
[9883]
[9884]
[9885]
[9886]
[9887]
[9888]
[9889]
[9890]
[9891]
[9892]
[9893]
[9894]
[9895]
[9896]
[9897]
[9898]
[9899]
[9900]
[9901]
[9902]
[9903]
[9904]
[9905]
[9906]
[9907]
[9908]
[9909]
[9910]
[9911]
[9912]
[9913]
[9914]
[9915]
[9916]
[9917]
[9918]
[9919]
[9920]
[9921]
[9922]
[9923]
[9924]
[9925]
[9926]
[9927]
[9928]
[9929]
[9930]
[9931]
[9932]
[9933]
[9934]
[9935]
[9936]
[9937]
[9938]
[9939]
[9940]
[9941]
[9942]
[9943]
[9944]
[9945]
[9946]
[9947]
[9948]
[9949]
[9950]
[9951]
[9952]
[9953]
[9954]
[9955]
[9956]
[9957]
[9958]
[9959]
[9960]
[9961]
[9962]
[9963]
[9964]
[9965]
[9966]
[9967]
[9968]
[9969]
[9970]
[9971]
[9972]
[9973]
[9974]
[9975]
[9976]
[9977]
[9978]
[9979]
[9980]
[9981]
[9982]
[9983]
[9984]
[9985]
[9986]
[9987]
[9988]
[9989]
[9990]
[9991]
[9992]
[9993]
[9994]
[9995]
[9996]
[9997]
[9998]
[9999]